program: Gaussian 09
title: 000298094
version: EM64L-G09RevD.01
frameworkgroup: C1[X(C6H8ClN3)]
method: RPBEPBE
basis: SDD
operation: Freq
keyword: #p
keyword: freq=noraman
keyword: PBEPBE/SDD
title: #p freq=noraman PBEPBE/SDD
converged: NO YES NO NO
title: Mulliken charges:
elementType: Cl N N N C C C C C C H H H H H H H H
charge: -0.071677 -0.051183 0.093372 -0.621962 0.142490 0.103242 -0.767389 -0.768007 0.237500 -0.373013 0.253340 0.228801 0.228904 0.226036 0.225948 0.256044 0.329084 0.328469
chargesum: 0.00000
title: Mulliken charges with hydrogens summed into heavy atoms:
elementType: Cl N N N C C C C C C
charge: -0.071677 -0.051183 0.093372 0.035591 0.142490 0.103242 -0.056344 -0.059979 0.237500 -0.373013
polarizability: 1.47376698e+02 6.75659811e+00 1.00937884e+02 -1.28483747e-02 8.09846302e-03 4.67863965e+01
1716.lowfreq: -7.8711 -0.0014 -0.0004 0.0021 8.0287 11.2458 67.0010 80.3458 129.0287
frequency: 66.8442 80.1709 129.0168 169.8367 216.8150 256.3529 277.7749 292.3552 350.8262 374.2936 456.4130 485.8477 486.8447 513.4132 517.9653 601.9853 626.4866 683.4314 750.1431 778.9655 949.0937 958.6061 1025.5133 1042.4570 1052.0304 1074.6601 1158.6455 1278.6510 1340.1247 1368.1325 1394.6445 1400.3674 1442.3785 1455.5716 1461.2468 1473.7964 1475.3871 1499.6989 1557.5593 1618.0024 2976.0925 2981.6133 3048.1620 3056.7303 3113.5182 3118.8277 3543.3524 3697.8696
redmass: 1.8412 1.5042 1.2057 2.5701 6.8387 4.8781 2.5129 3.5277 6.4945 4.0351 2.0225 5.2906 1.5647 1.3584 3.0420 6.0987 4.2063 7.5650 7.9628 4.8709 1.9200 1.9170 1.4043 3.3361 1.6161 1.7851 3.5598 5.6948 5.5871 2.5794 1.6452 1.3026 1.9544 1.4929 1.0469 1.0458 1.4911 3.3917 2.5255 1.9104 1.0385 1.0387 1.0973 1.0969 1.0974 1.0980 1.0443 1.1055
irintensity: 0.2360 0.4038 4.0153 5.4253 0.6306 0.9294 0.5127 15.3170 9.1844 2.0537 123.7793 8.3096 123.1565 64.8867 1.1532 0.9661 3.7858 0.9684 5.7574 13.5587 3.0577 124.2790 6.8873 45.7917 0.1818 11.6472 24.0273 15.9411 6.0182 56.4910 74.7128 5.2632 90.1526 16.8037 0.0017 37.6589 86.4653 11.1374 2.5255 372.2114 36.3679 13.6359 30.4800 9.4483 9.7395 9.0925 99.8944 47.9740
temp: 298.150 k
press: 1.00000 atm
elementType: 17 7 7 7 6 6 6 6 6 6 1 1 1 1 1 1 1 1
symmnumber: 1
zpe: 356956.8 jmol-1
zpe.correction: 0.135958 hartree
zpe.thermalcorrener: 0.146312 hartree
zpe.thermalcorrenthalpy: 0.147256 hartree
zpe.thermalcorrgfe: 0.099942 hartree
zpe.sumelectzpe: -857.020884 hartree
zpe.sumelectthermal: -857.010529 hartree
zpe.sumelectthermalent: -857.009585 hartree
zpe.sumelectthermalfe: -857.056899 hartree
dipole: -1.4954 2.2084 0.0087
dipole: 2.6671
quadrupole: -56.7848 -64.7596 -67.3382
quadrupole: 9.1747 0.0198 0.0254
quadrupole: 6.1760 -1.7987 -4.3773 9.1747 0.0198 0.0254
hfenergy: -857.1568412 hartree
pointgroup: C01 [X(C6H8Cl1N3)]
dipole: 0.4532917 0.9463323 -0.0073873 debye
dipolederiv: -0.9448912 -0.3490007 0.0135177 -0.412965 -0.339746 0.0064451 0.0126838 0.0049699 -0.110049 -0.5541994 0.4020335 0.0055923 -0.2462324 -0.3863156 0.0039107 0.0034277 -0.0076937 -0.2742151 -0.2673294 -0.0122055 0.0011579 0.2141395 -0.2897849 -0.0043116 0.003272 -0.0004765 -0.1623657 -1.0924712 0.6564511 0.0097602 0.73149 -0.6342297 -0.014053 0.010376 -0.0127229 -0.7112788 0.4377869 0.0021127 -0.0062292 0.6085646 0.3424841 -0.0100518 -0.0033822 0.0017181 0.0492071 0.1557956 -0.2101598 -0.0041834 -0.7414222 -0.0134779 0.0139512 -0.0064873 0.0035706 -0.0088756 -0.2318581 -0.1186059 0.0043963 -0.0959732 0.0201313 0.0014508 0.0045262 0.0018782 0.0514044 -0.1435968 0.1192294 0.0045811 0.0866799 -0.0134285 -0.0019327 0.0044003 -0.0024255 0.0749742 0.8742268 -0.9019941 -0.0137067 -1.110822 0.5769209 0.0215709 -0.0137555 0.0160219 0.259527 1.1724516 0.4868742 -0.0189258 1.0614515 0.2046935 -0.0185208 -0.0171452 -0.0067025 -0.0060021 0.1040332 0.0732403 0.0008493 -0.037407 -0.0962324 -0.0010182 -0.000114 -0.0030441 0.1206797 -0.006594 -0.0150635 -0.0811476 0.0174524 0.0725916 0.0797417 -0.1188799 0.0348605 -0.0349023 0.0005466 -0.0176527 0.0797436 0.0127108 0.0745211 -0.0782769 0.1177793 -0.0325027 -0.0441006 -0.0241323 0.0346343 0.0924663 0.0023846 0.0695752 0.0677449 0.1326816 0.013784 -0.0514346 -0.0326938 0.0346623 -0.0929015 0.0006384 0.0701264 -0.0671154 -0.1334486 -0.0143528 -0.0435536 0.0967831 -0.0923414 0.0001849 0.0127681 -0.0815509 -0.0009768 0.0005186 0.0009861 0.1229123 0.277286 -0.0513319 0.0014359 -0.0332992 0.2014295 0.0002516 0.0009031 0.0007355 0.3859182 0.1788565 -0.0408823 0.0034085 -0.0701586 0.2222922 0.0011904 0.0026442 0.0013959 0.3821546 unknown
polarizability: 148.3043717|0.3359542|99.9761461|-1.8337664|0.2178928|46.8204605 unknown
InChI: InChI=1S/C6H8ClN3/c1-3-4(2)10-6(8)5(7)9-3/h8H2,1-2H3
charge 0 multiplicity 1
18 atoms
Cl -2.826091 -1.459103 0.077761
N  0.083765 1.424811 0.037668
N  -0.08499 -1.372227 0.028425
N  -2.268876 1.592404 0.079272
C  1.216211 0.657619 0.01334
C  1.149525 -0.769638 0.007977
C  2.538639 1.388354 -0.004988
C  2.371869 -1.655369 -0.018371
C  -1.139249 0.809502 0.057644
C  -1.171335 -0.620932 0.052375
H  2.360672 2.474247 0.006758
H  3.159684 1.119559 0.870293
H  3.126797 1.133752 -0.906862
H  2.98887 -1.474514 -0.919155
H  3.022586 -1.480826 0.859607
H  2.057311 -2.710402 -0.016163
H  -3.191247 1.163667 0.09322
H  -2.159441 2.603798 0.077898
