program: Gaussian 09
title: 000298140
version: EM64L-G09RevD.01
frameworkgroup: C1[X(C16H15ClO5)]
method: RPBEPBE
basis: SDD
operation: Freq
keyword: #p
keyword: freq=noraman
keyword: PBEPBE/SDD
title: #p freq=noraman PBEPBE/SDD
converged: YES YES NO NO
title: Mulliken charges:
elementType: Cl O O O O O C C C C C C C C C C C C C C C C H H H H H H H H H H H H H H H
charge: -0.003395 -0.252728 -0.191686 -0.179978 -0.215880 -0.277994 0.071303 -0.137221 -0.489567 0.065006 0.155766 -0.735674 0.023681 0.482910 -0.116882 -0.286871 0.228511 -0.628058 -0.565140 0.495240 -0.531488 -0.514163 0.247901 0.275310 0.220896 0.217299 0.231086 0.246311 0.216138 0.249927 0.270175 0.255190 0.227203 0.226975 0.245176 0.238019 0.236702
chargesum: 0.00000
title: Mulliken charges with hydrogens summed into heavy atoms:
elementType: Cl O O O O O C C C C C C C C C C C C C C C C
charge: -0.003395 -0.252728 -0.191686 -0.179978 -0.215880 -0.277994 0.071303 0.110680 0.006639 0.065006 0.155766 -0.040977 0.023681 0.482910 0.099255 -0.036944 0.228511 -0.628058 -0.294965 0.495240 0.177880 0.205734
polarizability: 2.84169822e+02 1.16513199e+01 2.05405981e+02 9.13139124e+00 2.77879576e+00 1.39622804e+02
1716.lowfreq: -6.8098 -6.3107 -0.0012 -0.0009 -0.0003 7.1241 30.5948 44.8248 58.1135
frequency: 30.4767 44.7853 58.0972 66.1389 72.2717 106.3948 116.1665 131.0027 142.3599 151.3830 158.6278 187.2834 189.1457 220.4454 227.1750 233.2176 244.5917 261.9956 290.9025 309.9384 312.7176 326.8418 350.0292 360.3131 385.2374 420.0574 437.9599 444.5450 471.4100 513.2744 557.2166 573.4924 594.8291 611.2980 636.5474 648.4406 675.6245 693.5333 722.8881 747.6384 767.9202 808.9481 835.3945 843.7694 881.7183 897.5993 904.4777 936.9071 948.2173 954.8012 990.8815 1001.9123 1022.3295 1043.8792 1085.3134 1097.0910 1104.9909 1110.2632 1111.3522 1121.6696 1150.4019 1156.1223 1179.5113 1196.4617 1213.3395 1215.6927 1239.7959 1299.5199 1314.3812 1326.5600 1347.9595 1367.5784 1374.9939 1390.1843 1398.6597 1425.8763 1435.5507 1447.9172 1457.7039 1466.1854 1467.2219 1468.2211 1477.0153 1481.6104 1484.4976 1575.7235 1590.2971 1609.6841 1621.6413 1637.1658 2970.7097 2974.5147 2982.8597 2985.0573 2998.7817 3028.8727 3063.8769 3076.6177 3093.5393 3111.9349 3112.9200 3126.8361 3138.7034 3154.7173 3186.0378
redmass: 5.0760 3.8971 5.0863 6.5277 4.1011 4.6463 5.6441 6.1100 3.7622 3.4286 1.3706 3.4417 2.8365 1.9255 2.8153 1.1123 3.8050 3.5914 3.9808 3.0617 7.8914 5.1078 5.6537 8.6586 6.1736 3.3959 5.1540 5.0488 6.3760 5.8910 5.2388 5.7135 4.7959 5.5378 6.0681 4.5263 6.0390 3.1181 3.4174 5.0804 3.6199 3.5990 4.8249 2.3470 2.3902 2.3143 3.1302 7.7412 6.3535 2.9669 1.3348 2.0336 3.1975 5.3839 4.5021 2.1291 1.2498 1.2603 2.3622 2.1031 1.4668 1.4106 2.7348 2.7117 1.5112 1.9056 1.9459 1.3129 3.3832 1.6578 1.6062 7.5045 1.8075 1.2462 5.7871 1.2715 1.0936 1.3651 1.0593 1.1480 1.0795 1.0504 1.0495 2.4742 1.0507 10.2518 10.6746 8.9452 11.7771 6.8193 1.0325 1.0663 1.0743 1.0393 1.0292 1.0985 1.1044 1.0995 1.0998 1.1045 1.0877 1.1052 1.1004 1.0975 1.0908
irintensity: 7.2710 2.0744 2.1826 3.5868 6.1067 1.3394 0.2063 3.5836 1.2322 1.7614 0.4538 6.4789 1.6414 0.1773 0.3946 0.0113 1.4527 3.5935 5.0909 1.5808 2.1085 3.7391 3.7800 8.5409 0.7490 2.0793 3.0376 6.9937 7.8084 25.0571 5.1900 1.8568 10.3055 25.2350 1.7386 9.3134 12.6342 3.6102 19.4067 3.1575 9.3974 23.7863 8.1882 45.1300 6.5720 10.3944 28.6027 3.0099 111.3577 58.9305 0.8869 6.0387 28.5420 135.1511 78.4977 11.9547 2.4452 0.0653 18.0612 30.5076 5.3239 29.0212 292.8660 42.4024 3.5362 90.0371 25.7696 5.7972 95.5812 19.1092 6.6853 57.2948 19.2953 16.9526 89.2732 44.3504 44.0488 22.8904 17.1989 83.1282 53.1551 15.9315 21.0537 63.0315 10.5828 280.1304 179.1822 505.1728 80.3536 125.8384 59.9177 10.2856 7.2165 26.6958 62.4484 19.8653 37.1991 35.9080 15.1554 28.5029 18.7090 20.4151 14.4421 22.1130 1.2099
temp: 298.150 k
press: 1.00000 atm
elementType: 17 8 8 8 8 8 6 6 6 6 6 6 6 6 6 6 6 6 6 6 6 6 1 1 1 1 1 1 1 1 1 1 1 1 1 1 1
symmnumber: 1
zpe: 723855.5 jmol-1
zpe.correction: 0.275702 hartree
zpe.thermalcorrener: 0.296883 hartree
zpe.thermalcorrenthalpy: 0.297827 hartree
zpe.thermalcorrgfe: 0.225621 hartree
zpe.sumelectzpe: -1453.221568 hartree
zpe.sumelectthermal: -1453.200387 hartree
zpe.sumelectthermalent: -1453.199443 hartree
zpe.sumelectthermalfe: -1453.271649 hartree
dipole: -1.2880 1.0694 1.8315
dipole: 2.4813
quadrupole: -100.2453 -129.9217 -138.1700
quadrupole: -8.9492 8.9858 -2.8743
quadrupole: 22.5337 -7.1427 -15.3910 -8.9492 8.9858 -2.8743
hfenergy: -1453.4972703 hartree
pointgroup: C01 [X(C16H15Cl1O5)]
dipole: -0.5884731 0.387146 0.6758742 debye
polarizability: 279.596512|19.0458169|208.5140258|17.1531329|3.1818861|141.08807 unknown
InChI: InChI=1S/C16H15ClO5/c1-8-5-4-6-11(18)16(8)15(19)12-9(20-2)7-10(21-3)13(17)14(12)22-16/h4,6-8H,5H2,1-3H3
charge 0 multiplicity 1
37 atoms
Cl -2.050081 -2.988172 0.329807
O  0.500967 -1.308977 0.241213
O  1.588238 2.164556 0.134535
O  1.657543 -1.023677 -2.23906
O  -1.381013 3.021717 -0.173329
O  -4.409973 -0.733026 -0.146364
C  1.632192 -0.340338 0.125891
C  2.596109 -0.570273 1.317406
C  3.885012 0.273395 1.134559
C  0.949435 1.07868 0.09192
C  2.318263 -0.590281 -1.255862
C  1.925518 -0.301545 2.680367
C  -0.48529 0.809084 -0.000855
C  -0.679563 -0.594061 0.078921
C  4.463153 0.182468 -0.255053
C  3.744502 -0.227495 -1.342773
C  -1.624604 1.659376 -0.11274
C  -1.948233 -1.196611 0.055672
C  -2.9032 1.070814 -0.172555
C  -3.075401 -0.343436 -0.099412
C  -2.538406 3.918771 -0.298466
C  -4.82506 -2.011358 -0.76639
H  2.881806 -1.641616 1.268777
H  3.664174 1.339104 1.348637
H  4.638716 -0.047394 1.879665
H  2.625895 -0.538703 3.502025
H  1.633059 0.75956 2.780649
H  1.027501 -0.929682 2.808778
H  5.513466 0.477539 -0.386463
H  4.189582 -0.287497 -2.342357
H  -3.81479 1.658982 -0.297262
H  -2.108827 4.930024 -0.314553
H  -3.220459 3.809782 0.565896
H  -3.088244 3.726352 -1.239112
H  -4.768334 -2.836418 -0.03945
H  -5.869076 -1.836999 -1.068969
H  -4.204977 -2.245047 -1.649093
