program: Gaussian 09
title: 000298125
version: EM64L-G09RevD.01
frameworkgroup: C1[X(C13H12O7)]
method: RPBEPBE
basis: SDD
operation: Freq
keyword: #pfreq=noraman
keyword: PBEPBE/SDD
title: #p freq=noraman PBEPBE/SDD
converged: YES YES NO NO
title: Mulliken charges:
elementType: O O O O O O O C C C C C C C C C C C C C H H H H H H H H H H H H
charge: -0.268050 -0.290625 -0.298533 -0.201020 -0.198810 -0.194646 -0.200872 0.099119 0.318545 0.369637 0.482631 -0.539916 -0.499305 -0.211705 0.275674 0.262402 0.280206 -0.743302 -0.743258 -0.755818 0.296421 0.285598 0.179267 0.255768 0.248878 0.260994 0.249882 0.251980 0.258418 0.267170 0.250593 0.252675
chargesum: 0.00000
title: Mulliken charges with hydrogens summed into heavy atoms:
elementType: O O O O O O O C C C C C C C C C C C C C
charge: -0.268050 -0.290625 -0.298533 -0.201020 -0.198810 -0.194646 -0.200872 0.099119 0.318545 0.369637 0.482631 -0.243495 -0.213707 -0.032438 0.275674 0.262402 0.280206 0.022338 0.017022 0.014620
polarizability: 1.97766771e+02 5.21574552e+00 2.19045125e+02 -4.57757605e+00 -6.87028053e+00 1.01039537e+02
1716.lowfreq: -5.7759 -3.4533 -0.0011 -0.0010 -0.0008 1.0336 19.4881 34.4207 43.9329
frequency: 19.4781 34.3543 43.9321 45.9906 58.9992 62.8000 64.5616 75.0897 87.8403 99.8045 103.7381 115.2822 132.9073 181.0259 189.0561 225.0515 253.6061 262.2707 286.7906 292.9707 307.3482 348.0472 378.3047 430.3091 484.6360 517.3733 525.6139 538.4152 541.7675 550.0202 569.9158 579.1527 589.4603 644.5863 666.9949 714.0373 738.2323 759.6480 790.3792 814.1588 858.5645 881.1221 922.7946 975.1839 979.7026 982.4159 996.5580 999.1705 1015.4928 1039.2238 1040.2595 1042.9298 1099.2672 1146.6963 1155.3159 1172.6861 1192.6566 1221.2428 1294.7926 1364.3125 1383.7028 1383.8851 1385.8387 1398.4766 1421.7811 1450.0900 1451.0306 1451.6719 1452.6639 1453.0842 1454.9644 1465.9057 1578.8585 1600.4194 1622.5825 1685.6469 1694.4367 1698.2087 2887.4720 3006.9236 3010.6503 3010.8850 3098.4391 3099.1571 3099.5189 3144.7554 3146.8037 3147.2568 3171.2008 3183.5062
redmass: 9.1254 1.3217 4.4387 5.3777 2.9673 4.0143 4.4896 2.4958 1.4138 4.5785 6.5773 1.0439 6.5181 7.7213 5.8684 4.2611 4.6588 7.4441 5.0580 3.9305 4.6669 4.4270 5.9943 5.0936 4.7711 4.9179 5.4697 3.5215 3.3933 3.2122 5.0495 4.4691 5.3227 5.4310 6.3219 4.9776 5.6266 6.6793 5.2224 6.7390 6.8982 1.5626 1.4387 3.1543 2.3554 2.3751 1.8618 2.3441 7.1458 1.6481 1.6535 1.6362 3.3923 2.3843 2.9507 3.3293 2.5089 1.4447 6.6061 2.0039 1.2388 1.2416 1.2391 4.4900 2.9689 1.0496 1.0501 1.0660 1.0556 1.0530 1.0521 3.9231 9.4990 6.9898 7.4878 10.4872 10.4110 10.5762 1.0857 1.0377 1.0372 1.0368 1.0971 1.0955 1.0963 1.1018 1.1018 1.1013 1.0927 1.0925
irintensity: 0.3434 3.2219 0.7034 0.0808 1.7461 2.7640 2.9874 1.3395 0.3011 6.0756 2.8292 0.4703 11.4880 9.4013 5.7582 1.8464 0.6682 2.6206 1.7288 1.5259 1.6965 4.5208 0.3254 5.9963 9.9974 9.9995 12.7874 4.1820 5.5133 2.3026 7.8320 17.1067 4.5721 11.5234 11.9607 29.4026 30.3565 77.8380 38.7724 31.1319 80.0177 22.7423 11.9939 1.6624 46.3944 86.4771 13.7840 82.5821 464.8706 20.0521 5.5663 7.8078 164.3291 76.9656 676.7447 461.9310 5.6589 0.6963 235.9891 25.0128 60.9885 40.1816 90.0047 12.1809 82.1836 35.9343 14.0494 13.1747 30.4049 35.2275 7.2745 32.7772 145.7838 41.7483 130.7997 189.0890 69.0143 236.0886 105.3117 0.3326 0.5084 0.8050 5.0091 4.6936 4.8764 8.7587 8.2412 8.9772 4.2976 0.7938
temp: 298.150 k
press: 1.00000 atm
elementType: 8 8 8 8 8 8 8 6 6 6 6 6 6 6 6 6 6 6 6 6 1 1 1 1 1 1 1 1 1 1 1 1
symmnumber: 1
zpe: 595406.3 jmol-1
zpe.correction: 0.226778 hartree
zpe.thermalcorrener: 0.247970 hartree
zpe.thermalcorrenthalpy: 0.248915 hartree
zpe.thermalcorrgfe: 0.173356 hartree
zpe.sumelectzpe: -1027.685609 hartree
zpe.sumelectthermal: -1027.664417 hartree
zpe.sumelectthermalent: -1027.663473 hartree
zpe.sumelectthermalfe: -1027.739031 hartree
dipole: -0.7289 -5.9227 0.9693
dipole: 6.0456
quadrupole: -100.5121 -114.4888 -124.1107
quadrupole: -6.0095 -13.0327 4.5181
quadrupole: 12.5251 -1.4516 -11.0735 -6.0095 -13.0327 4.5181
hfenergy: -1027.9123876 hartree
pointgroup: C01 [X(C13H12O7)]
dipole: 1.4856813 1.8151687 0.3939535 debye
polarizability: 208.7859504|11.8724881|208.0200579|3.0233771|7.6772184|101.0454244 unknown
InChI: InChI=1S/C13H12O7/c1-7(15)18-11-4-10(6-14)5-12(19-8(2)16)13(11)20-9(3)17/h4-6H,1-3H3
charge 0 multiplicity 1
32 atoms
O  0.714931 1.516939 0.180303
O  -2.012627 1.617311 -0.379203
O  2.012397 -0.905965 0.578528
O  -3.554168 -3.364377 -0.316456
O  2.219809 0.998479 -1.556395
O  -1.765931 2.277208 1.863204
O  2.606166 -2.88682 -0.552977
C  0.009248 0.302032 0.078178
C  -1.391237 0.362857 -0.137044
C  0.633733 -0.95858 0.260059
C  -1.520265 -2.062035 -0.044955
C  -2.157609 -0.805615 -0.202978
C  -0.126208 -2.142145 0.194729
C  -2.31151 -3.317851 -0.120247
C  1.865424 1.760001 -0.644794
C  -2.120447 2.548852 0.706912
C  2.943074 -1.870838 0.075719
C  2.50484 3.052554 -0.205742
C  -2.7330 3.827645 0.192144
C  4.338912 -1.426904 0.431179
H  -3.23601 -0.761554 -0.381897
H  0.357537 -3.113634 0.319923
H  -1.715023 -4.25504 0.012217
H  1.746867 3.848979 -0.123225
H  3.287375 3.343515 -0.920724
H  2.948166 2.921715 0.797459
H  -2.846736 4.544163 1.017718
H  -2.095181 4.260497 -0.597768
H  -3.716793 3.619333 -0.262388
H  4.62651 -0.590931 -0.232159
H  5.042556 -2.259349 0.287151
H  4.380299 -1.061141 1.469928
