program: Gaussian 09
title: 000298100
version: EM64L-G09RevD.01
frameworkgroup: C1[X(C8H6Cl2N2O2S)]
method: RPBEPBE
basis: SDD
operation: Freq
keyword: #p
keyword: freq=noraman
keyword: PBEPBE/SDD
title: #p freq=noraman PBEPBE/SDD
converged: NO YES NO NO
title: Mulliken charges:
elementType: Cl Cl S O O N N C C C C C C C C H H H H H H
charge: 0.178465 0.220827 0.293527 -0.159135 -0.170419 -0.485624 -0.503351 0.141908 -0.062212 0.270750 -0.697933 0.350689 -0.262957 -0.133781 -0.500280 0.244442 0.251508 0.251266 0.253035 0.250137 0.269137
chargesum: 0.00000
title: Mulliken charges with hydrogens summed into heavy atoms:
elementType: Cl Cl S O O N N C C C C C C C C
charge: 0.178465 0.220827 0.293527 -0.159135 -0.170419 -0.485624 -0.503351 0.141908 -0.062212 0.270750 0.049282 0.350689 -0.009923 0.116356 -0.231143
polarizability: 1.98114371e+02 3.13695052e+00 1.35281033e+02 -1.27094477e+01 -8.04839981e+00 1.15924336e+02
1716.lowfreq: -5.3016 -3.7904 -0.0026 -0.0005 -0.0005 3.6202 30.1892 39.1057 62.4562
frequency: 30.1650 39.1005 62.4507 85.3406 112.5676 153.3506 171.6330 178.5203 199.2233 235.5490 242.2841 264.3552 294.5838 301.5358 318.3513 345.7851 456.0626 476.8623 534.9765 564.4074 602.8105 653.2193 661.2320 677.2271 692.8454 708.5518 711.1828 747.0497 817.3149 836.0445 848.2919 914.2813 952.7755 1011.5027 1056.9924 1061.9780 1080.9451 1092.4640 1110.4021 1153.5500 1195.0865 1221.3770 1252.5178 1339.8701 1382.9863 1464.1113 1470.3147 1474.0766 1549.2040 1690.8163 1735.6615 3005.6744 3109.6779 3120.4914 3177.1493 3193.9244 3238.4631
redmass: 6.8937 12.1372 9.6795 17.4273 10.2313 13.7097 6.1525 7.1285 11.8263 1.6624 1.8957 4.3781 19.3782 12.5898 3.9467 10.8705 6.1975 6.1117 8.7681 3.3498 10.7639 8.5533 11.0441 7.2501 6.7692 5.7404 1.1920 4.8441 4.8067 1.8999 2.2650 1.3884 4.1506 2.4574 6.1187 1.8611 2.6728 1.1885 3.1473 8.8248 4.4361 2.4414 2.4734 2.3913 1.1839 1.4204 1.3488 1.6796 5.8076 12.8432 12.8727 1.0344 1.1011 1.1015 1.0898 1.0978 1.1006
irintensity: 0.2861 0.2768 1.3247 0.8124 2.8072 0.6132 1.7834 1.8418 1.3224 1.7551 1.9497 0.4613 2.3539 2.6498 2.0811 0.6596 8.2665 11.8516 13.0551 1.0997 7.5086 116.2751 11.8141 9.4120 16.8472 1.1453 89.5611 32.0012 20.5141 1.6605 25.8564 0.3626 20.5347 7.9840 64.7815 10.0957 25.4546 2.2405 15.4355 10.9815 7.5610 18.6356 104.4908 11.2658 19.5621 16.7079 20.0182 2.3465 14.8673 502.0592 183.4697 5.4533 12.5305 3.4144 4.9815 2.6914 0.5565
temp: 298.150 k
press: 1.00000 atm
elementType: 17 17 16 8 8 7 7 6 6 6 6 6 6 6 6 1 1 1 1 1 1
symmnumber: 1
zpe: 341409.2 jmol-1
zpe.correction: 0.130036 hartree
zpe.thermalcorrener: 0.144801 hartree
zpe.thermalcorrenthalpy: 0.145745 hartree
zpe.thermalcorrgfe: 0.086383 hartree
zpe.sumelectzpe: -1885.418518 hartree
zpe.sumelectthermal: -1885.403752 hartree
zpe.sumelectthermalent: -1885.402808 hartree
zpe.sumelectthermalfe: -1885.462171 hartree
dipole: -3.8615 0.0233 2.1101
dipole: 4.4004
quadrupole: -100.8406 -116.5068 -99.8587
quadrupole: -1.9342 3.0227 6.0514
quadrupole: 4.8948 -10.7714 5.8767 -1.9342 3.0227 6.0514
hfenergy: -1885.5485535 hartree
pointgroup: C01 [X(C8H6Cl2N2O2S1)]
dipole: -1.5496225 -0.1513491 -0.7570039 debye
dipolederiv: 0.0456948 -0.057303 -0.0347022 0.044108 -0.7047595 -0.0318833 -0.0745041 -0.1494399 0.0451394 -0.6721186 -0.2276985 -0.1134051 -0.5573802 -0.1532634 -0.0678855 -0.3602044 -0.0968952 0.0683042 -0.0766266 0.0699758 -0.1171495 0.0138093 0.116983 0.0835649 -0.1745488 0.0650151 -0.1302513 -0.4025563 0.1381113 -0.0559631 0.245925 -1.0247486 0.2213139 -0.0762635 0.1471055 -0.3367028 -0.987664 0.2775372 -0.2152011 0.4053282 -0.5063279 0.144225 -0.2837684 0.1309741 -0.3869659 -1.0911726 -0.160991 -0.1120542 0.0033135 0.6706885 0.0795631 -0.0115694 0.1225372 -0.3552532 0.1884444 0.7778216 -0.0361502 0.7591004 -0.594059 0.3083259 0.2138245 0.4417434 -0.2305961 0.9395327 -0.2921356 -0.1922521 -0.1707198 -0.0635598 -0.0068834 -0.1713094 -0.1149145 0.2952919 -0.4207475 0.0013464 0.1036464 0.0905966 -0.2056066 -0.1345654 0.0218707 -0.1205111 0.2612195 0.6636337 -0.2864829 0.3135228 -0.3955338 1.0759409 -0.3553161 0.264162 -0.2111402 0.3472425 -0.1076754 0.0064206 0.0129297 -0.020724 0.0131053 -0.0431683 0.0229226 0.034422 -0.0551114 1.6349002 -0.1822402 0.397294 -0.31165 1.2302201 -0.2208348 0.4361139 -0.2776176 0.4375496 0.1312696 0.0306664 -0.1933138 -0.0746542 -0.1144503 0.0066077 0.0039545 -0.0089304 -0.0374908 -0.0385139 -0.044936 0.0258299 -0.0538028 -0.1306422 0.0099506 0.1566407 0.0407339 -0.2301232 0.029346 -0.1405328 0.1848911 -0.077487 -0.2214439 -0.1157653 0.0767415 -0.1065496 0.0085788 -0.0786011 0.0162954 0.0882113 0.011559 0.0959793 -0.0171606 0.0571989 -0.0065229 0.0452265 0.0417594 -0.0732392 -0.0287235 -0.0829703 -0.0053336 -0.0298773 -0.0426624 -0.0045263 0.058112 0.06167 0.0617742 -0.0584741 0.0752744 -0.0014364 0.0541139 -0.0402683 0.0144243 0.0775393 0.1476264 0.008618 -0.0082152 -0.00313 0.154099 0.061377 0.0019958 0.0397877 -0.0375686 -0.0517488 0.0544937 -0.0221754 0.0685128 0.1711585 0.0237166 -0.0551665 0.0318542 0.1008586 0.0435476 0.0224986 0.0614542 0.0305247 0.1974567 0.0305814 0.0348401 0.0284503 0.055001 unknown
polarizability: 199.1301356|4.1178526|136.4458834|9.2544443|-4.8929112|113.7437211 unknown
InChI: InChI=1S/C8H6Cl2N2O2S/c1-8(5-3-2-4-15-5)6(13)11(9)7(14)12(8)10/h2-4H,1H3
charge 0 multiplicity 1
21 atoms
Cl 0.550432 -2.926323 -0.35533
Cl 3.322788 1.824928 0.621154
S  -1.613098 -0.390407 1.661412
O  0.432582 2.344559 -0.740485
O  3.071068 -1.324508 0.707659
N  0.808501 -1.148074 -0.072798
N  1.991139 0.738974 0.080438
C  -0.055463 -0.138625 -0.741337
C  -1.417398 -0.056762 -0.107351
C  0.7927 1.188282 -0.466114
C  -0.11444 -0.319619 -2.279116
C  2.086686 -0.701749 0.287845
C  -2.619438 0.342882 -0.675197
C  -3.715336 0.385608 0.259204
C  -3.350495 0.026362 1.547078
H  0.903968 -0.417536 -2.692069
H  -0.692009 -1.224762 -2.528088
H  -0.59372 0.559572 -2.739533
H  -2.723559 0.609775 -1.729009
H  -4.733496 0.66985 -0.015658
H  -3.968315 -0.044829 2.440595
