program: Gaussian 09
title: 000298117
version: EM64L-G09RevD.01
frameworkgroup: C1[X(C12H12O5)]
method: RPBEPBE
basis: SDD
operation: Freq
keyword: #pfreq=noraman
keyword: PBEPBE/SDD
title: #p freq=noraman PBEPBE/SDD
converged: YES YES NO NO
title: Mulliken charges:
elementType: O O O O O C C C C C C C C C C C C H H H H H H H H H H H H
charge: -0.285388 -0.300644 -0.198155 -0.213404 -0.202818 0.237397 0.301324 -0.582458 -0.333091 -0.298994 0.248853 -0.217296 -0.219696 0.250566 -0.753902 0.253296 -0.761622 0.240084 0.286164 0.253020 0.267163 0.234639 0.234010 0.235894 0.283443 0.251566 0.245479 0.300126 0.244442
chargesum: 0.00000
title: Mulliken charges with hydrogens summed into heavy atoms:
elementType: O O O O O C C C C C C C C C C C C
charge: -0.285388 -0.300644 -0.198155 -0.213404 -0.202818 0.237397 0.301324 -0.056210 -0.080071 -0.031830 0.248853 0.017343 0.014314 0.250566 0.017001 0.253296 0.028425
polarizability: 1.84184128e+02 -1.25838859e+01 1.51952619e+02 9.22989299e-01 4.20201243e+00 9.54475640e+01
1716.lowfreq: -6.2432 -4.2074 -0.0006 -0.0004 0.0004 4.6151 22.1956 29.0753 44.6454
frequency: 22.1548 29.0705 44.6318 59.9948 67.2821 81.1270 93.5006 116.5288 149.1633 162.2833 165.9161 208.2201 251.2321 281.5033 308.7066 333.0847 382.4661 443.6219 455.8558 476.2050 502.1836 517.3347 532.7754 549.6723 560.9627 619.4631 640.3934 680.8214 706.0252 749.4663 759.0518 775.1841 808.5075 848.9184 870.6637 883.0951 904.3170 941.6044 981.3857 988.5104 1005.8966 1029.8120 1030.8096 1044.1856 1066.9702 1082.4937 1144.7613 1168.1390 1170.1251 1172.9786 1217.4989 1226.8343 1262.5295 1266.8671 1373.5076 1382.5340 1391.8150 1434.7083 1438.9850 1448.0416 1450.7273 1453.1064 1461.5823 1472.9488 1594.7373 1606.5810 1638.5522 1662.3536 1685.2059 2980.2706 3001.2985 3032.3023 3062.7566 3087.6535 3127.2790 3132.0029 3142.7592 3143.6063 3159.1830 3175.2075 3190.4579
redmass: 4.9468 7.7037 5.4405 5.4935 6.5962 4.0400 5.3110 3.8201 1.1625 2.0758 1.4717 6.2761 4.5463 8.3823 5.0080 4.1443 2.1679 3.9435 4.3702 4.0826 4.0888 4.2027 3.7533 4.6643 3.4556 5.4412 5.7607 4.5225 4.4392 2.7486 3.1860 2.1895 3.7732 2.5062 2.1863 4.3692 2.1176 1.3991 1.3210 2.1980 2.0758 1.8866 2.0256 1.6368 2.8321 2.7659 1.8802 1.8323 1.6262 1.6687 2.7674 2.1926 1.4786 1.5134 1.2606 9.8673 1.2360 1.0871 2.3178 1.0625 1.0552 1.0651 1.0580 2.7017 7.1403 7.3700 8.4490 9.6844 10.1948 1.0374 1.0376 1.0609 1.0956 1.0969 1.1005 1.1022 1.1007 1.0863 1.0917 1.0976 1.0971
irintensity: 0.6681 2.4220 0.4126 4.1437 0.6189 8.6794 4.1153 6.1172 1.4612 2.6205 2.0265 2.7380 2.1233 2.4480 0.3280 3.5090 1.8049 6.3353 5.1500 6.0249 20.0613 8.1620 0.3036 3.9956 2.5372 5.3851 5.1564 1.8955 5.2986 10.8969 22.0368 78.9857 9.6728 47.0962 24.7381 50.9050 3.4875 3.4323 0.0445 88.4310 36.5361 0.4749 18.4013 9.7045 358.5141 69.4488 143.2459 121.6708 290.0215 90.5610 122.1777 36.9904 34.6164 73.2046 86.5571 2.0469 58.2569 20.5351 10.8093 39.7266 32.5228 20.5126 37.0187 85.8905 16.9976 2.4321 245.3053 58.6361 180.9460 4.1299 4.9111 4.2366 3.7807 5.8619 9.5470 1.3148 9.2739 2.2307 15.5502 11.8034 2.2544
temp: 298.150 k
press: 1.00000 atm
elementType: 8 8 8 8 8 6 6 6 6 6 6 6 6 6 6 6 6 1 1 1 1 1 1 1 1 1 1 1 1
symmnumber: 1
zpe: 565671.9 jmol-1
zpe.correction: 0.215453 hartree
zpe.thermalcorrener: 0.232625 hartree
zpe.thermalcorrenthalpy: 0.233569 hartree
zpe.thermalcorrgfe: 0.167998 hartree
zpe.sumelectzpe: -839.347871 hartree
zpe.sumelectthermal: -839.330699 hartree
zpe.sumelectthermalent: -839.329755 hartree
zpe.sumelectthermalfe: -839.395326 hartree
dipole: -1.1894 -2.5006 1.0292
dipole: 2.9541
quadrupole: -82.4190 -94.8451 -103.5850
quadrupole: -0.6714 -0.5634 10.4968
quadrupole: 11.1974 -1.2287 -9.9687 -0.6714 -0.5634 10.4968
hfenergy: -839.5633237 hartree
pointgroup: C01 [X(C12H12O5)]
dipole: -0.5622501 0.4528404 -0.9108369 debye
polarizability: 163.8281924|25.5470818|161.9655458|16.196472|-13.8426309|105.7905733 unknown
InChI: InChI=1S/C12H12O5/c1-8(13)7-12(15)17-11-6-4-3-5-10(11)16-9(2)14/h3-6H,7H2,1-2H3
charge 0 multiplicity 1
29 atoms
O  -0.860105 1.296043 0.144316
O  0.660866 -0.974481 0.358242
O  -0.964462 0.381181 -2.016985
O  -3.101987 -1.854019 0.510802
O  1.845132 -1.779612 2.229484
C  0.564686 1.416567 0.100893
C  1.358868 0.260849 0.293244
C  -2.951325 0.34102 -0.545226
C  1.152475 2.684853 -0.032929
C  2.762251 0.37539 0.352077
C  -1.512231 0.654482 -0.933536
C  2.559579 2.801894 0.02959
C  3.357273 1.650386 0.220256
C  -3.153213 -1.19686 -0.558844
C  -3.376233 -1.82933 -1.917907
C  0.954829 -1.939922 1.378334
C  0.018466 -3.110123 1.220733
H  -3.620296 0.803275 -1.292605
H  -3.163636 0.732132 0.459791
H  0.509868 3.558457 -0.177197
H  3.374585 -0.514985 0.510813
H  3.02694 3.786589 -0.070511
H  4.4472 1.740783 0.269413
H  -4.335849 -1.478444 -2.344461
H  -2.578884 -1.502919 -2.612072
H  -3.392848 -2.926675 -1.838708
H  0.109521 -3.533171 0.205053
H  -1.02907 -2.779649 1.339219
H  0.2582 -3.87821 1.96972
