program: Gaussian 09
title: 000298083
version: EM64L-G09RevD.01
frameworkgroup: C1[X(C6H7ClO)]
method: RPBEPBE
basis: SDD
operation: Freq
keyword: #p
keyword: freq=noraman
keyword: PBEPBE/SDD
title: #p freq=noraman PBEPBE/SDD
converged: NO YES NO NO
title: Mulliken charges:
elementType: Cl O C C C C C C H H H H H H H
charge: -0.071730 -0.300184 -0.085665 -0.094107 -0.411166 -0.422779 -0.077740 -0.181810 0.231185 0.231277 0.255504 0.232069 0.215395 0.237801 0.241951
chargesum: 0.00000
title: Mulliken charges with hydrogens summed into heavy atoms:
elementType: Cl O C C C C C C
charge: -0.071730 -0.300184 0.145520 0.137170 0.076407 0.030417 -0.077740 0.060141
polarizability: 8.67397732e+01 1.00735791e+01 7.54263627e+01 -2.17002793e+00 1.85605104e+00 4.66771726e+01
1716.lowfreq: -10.6565 0.0010 0.0014 0.0020 6.5817 13.4867 85.6771 212.6277 258.0135
frequency: 85.6458 212.6247 258.0100 307.3588 316.8824 393.4022 409.6289 549.6327 601.5331 684.7167 766.7547 799.6004 851.6335 911.7951 928.9791 936.6835 950.5118 998.4250 1048.5559 1056.8102 1109.6529 1198.2314 1208.7360 1237.8559 1274.7215 1331.8925 1342.3974 1359.6846 1418.4664 1442.8078 1446.5292 1701.6116 2965.7450 2981.2711 3008.9601 3027.2864 3089.6634 3106.0423 3150.3080
redmass: 3.8213 2.9794 5.7524 2.5778 4.5799 3.4548 3.9720 4.9072 6.5621 6.1798 3.4921 1.5001 2.2960 3.6127 2.1784 2.2638 3.1861 2.2644 1.2414 1.4025 1.3574 1.1152 1.1382 1.1750 1.5237 1.6678 2.0024 1.6772 2.5720 1.0755 1.1704 7.4815 1.0609 1.0601 1.0977 1.0987 1.0867 1.0944 1.0925
irintensity: 3.5279 2.7336 1.6687 0.8516 5.4036 18.6114 8.5418 8.0434 19.6790 5.4802 15.9728 30.4151 20.4213 14.3440 16.0646 13.2563 36.2782 6.2958 5.3975 2.6111 1.3148 0.1801 4.3732 1.5786 0.8867 16.1065 9.9199 17.4691 7.4372 23.9913 0.5644 20.5182 33.4916 17.3189 14.3316 8.5287 18.1163 62.3974 4.5799
temp: 298.150 k
press: 1.00000 atm
elementType: 17 8 6 6 6 6 6 6 1 1 1 1 1 1 1
symmnumber: 1
zpe: 301883.9 jmol-1
zpe.correction: 0.114982 hartree
zpe.thermalcorrener: 0.122141 hartree
zpe.thermalcorrenthalpy: 0.123085 hartree
zpe.thermalcorrgfe: 0.082990 hartree
zpe.sumelectzpe: -767.455938 hartree
zpe.sumelectthermal: -767.448779 hartree
zpe.sumelectthermalent: -767.447835 hartree
zpe.sumelectthermalfe: -767.487930 hartree
dipole: 1.5343 0.7151 -2.4933
dipole: 3.0136
quadrupole: -58.4592 -47.4095 -56.3862
quadrupole: 2.7027 -5.2934 2.4873
quadrupole: -4.3742 6.6754 -2.3012 2.7027 -5.2934 2.4873
hfenergy: -767.57092 hartree
pointgroup: C01 [X(C6H7Cl1O1)]
dipole: -0.5543339 0.3261167 0.9960649 debye
dipolederiv: -0.846524 0.1239161 0.0891727 0.0581279 -0.206955 0.005496 0.1100431 -0.0043128 -0.1010405 -0.495534 -0.052659 -0.0817088 -0.0626157 -0.3858858 -0.052722 -0.1775814 -0.0846738 -0.587823 0.4257707 0.0375608 0.0066731 -0.031124 0.1779894 -0.0356472 0.070496 -0.0999941 0.2650416 0.3266478 0.1023903 -0.0378404 0.1101536 0.2633346 0.0393455 -0.0668666 0.1055768 0.2396851 -0.2761536 -0.0019053 0.0365299 0.0457349 -0.0423081 0.0485296 0.0767344 0.0379392 0.1701048 0.0123675 -0.0625207 0.0386616 0.004426 -0.0336924 -0.018031 0.0616927 0.0323096 0.1661042 1.0954429 -0.144942 -0.1577722 -0.0904392 0.3678769 -0.0362395 -0.1908684 -0.0450823 -0.114877 -0.116599 0.0151328 -0.0169935 0.0292701 -0.1549716 -0.0180618 -0.0310888 -0.015523 -0.1818457 -0.0603435 -0.0740678 0.0421222 -0.0669047 -0.0449144 0.1082548 0.024799 0.0996709 0.0182568 -0.1352707 0.0187551 0.1004234 0.0067802 0.0262865 -0.0438961 0.0840055 -0.051226 0.0333661 0.0572322 0.0178753 0.0227081 0.02073 -0.0198927 -0.0646594 0.0449634 -0.1125853 0.0282052 0.0442652 0.0005753 -0.0582433 0.0093163 0.0304861 0.0654018 -0.0525557 0.1152071 -0.0496127 -0.0064761 0.0381347 0.0298709 0.0114089 0.0058324 -0.1036612 0.066572 -0.1496613 -0.0472726 -0.0154589 0.0556863 -0.0470875 0.0315269 0.0052424 0.0744845 -0.0580357 0.1345389 -0.0051639 -0.0093664 -0.073932 0.0334838 -0.0763913 0.0115718 0.0314062 0.0376906 0.037816 0.1668717 unknown
polarizability: 85.3183717|-10.7563068|76.6351751|-3.4057205|-1.6622682|46.8897617 unknown
InChI: InChI=1S/C6H7ClO/c7-4-1-2-5-6(3-4)8-5/h1,5-6H,2-3H2
charge 0 multiplicity 1
15 atoms
Cl 2.993097 -0.272267 -0.227257
O  -1.738973 -0.587861 -0.913088
C  -1.077297 -1.043649 0.368521
C  -1.66616 0.33421 0.288405
C  0.427132 -1.266013 0.298103
C  -0.782827 1.561347 0.135978
C  1.188402 0.003834 0.016744
C  0.691058 1.255439 -0.064664
H  -1.642187 -1.827738 0.890217
H  -2.646789 0.507425 0.751749
H  0.650788 -2.018496 -0.483544
H  0.776168 -1.700056 1.256848
H  -0.901158 2.195067 1.040063
H  -1.154105 2.170438 -0.713103
H  1.354251 2.09972 -0.28247
