program: Gaussian 09
title: 000298081
version: EM64L-G09RevD.01
frameworkgroup: C1[X(C6H7BrO2)]
method: RPBEPBE
basis: SDD
operation: Freq
keyword: #p
keyword: freq=noraman
keyword: PBEPBE/SDD
title: #p freq=noraman PBEPBE/SDD
converged: YES YES NO NO
title: Mulliken charges:
elementType: Br O O C C C C C C H H H H H H H
charge: -0.014324 -0.282990 -0.306247 -0.087079 -0.086381 -0.028689 -0.089740 -0.508878 -0.381691 0.241219 0.239242 0.251790 0.236354 0.317466 0.236741 0.263206
chargesum: 0.00000
title: Mulliken charges with hydrogens summed into heavy atoms:
elementType: Br O O C C C C C C
charge: -0.014324 -0.282990 -0.306247 0.154140 0.152861 0.223102 0.146614 -0.191412 0.118257
polarizability: 1.10497559e+02 2.23743084e+00 6.93398653e+01 -2.65606551e+00 -2.59134186e+00 5.70473280e+01
1716.lowfreq: -0.0011 -0.0008 -0.0007 3.2841 7.7639 12.1616 90.0849 162.4671 196.3907
frequency: 90.0675 162.4522 196.3887 235.9168 267.2639 348.2041 387.9366 564.9361 574.6120 609.0659 675.8010 698.0545 755.2069 799.2899 839.4287 863.1069 910.1632 922.1125 993.6352 1027.9960 1046.7545 1053.0861 1088.5636 1148.8564 1155.4292 1191.3267 1224.3577 1247.2393 1312.9424 1325.1599 1342.7533 1361.7795 1394.7805 1419.9544 1451.4459 3019.6573 3074.0880 3089.6479 3106.1896 3113.9927 3123.6363 3134.4638
redmass: 5.8396 6.2475 6.5905 5.0005 3.8027 3.8199 6.3346 4.4351 4.6057 4.8104 7.1185 6.6086 3.7369 4.3150 2.5893 4.5073 3.0348 2.2223 2.1256 1.4447 1.3372 1.1689 1.3785 1.4486 1.3864 1.3020 1.3024 1.1625 1.4086 1.5189 1.6301 1.5072 3.3845 2.8316 1.1250 1.0600 1.0943 1.0938 1.0879 1.0877 1.0912 1.0971
irintensity: 1.3514 2.6895 0.7213 16.6615 9.1629 15.4321 6.6703 14.7528 0.7414 9.4450 4.5880 30.7090 4.1664 52.2404 23.1754 2.1353 7.6360 17.3722 2.8161 1.6943 5.8926 0.4909 1.6003 6.7714 23.4442 8.0026 1.0124 2.9706 12.1524 8.2808 4.5463 6.0254 4.8082 17.5504 7.5045 9.0697 5.2990 4.7932 12.0665 8.8831 38.5135 26.0192
temp: 298.150 k
press: 1.00000 atm
elementType: 35 8 8 6 6 6 6 6 6 1 1 1 1 1 1 1
symmnumber: 1
zpe: 313109.0 jmol-1
zpe.correction: 0.119257 hartree
zpe.thermalcorrener: 0.127138 hartree
zpe.thermalcorrenthalpy: 0.128082 hartree
zpe.thermalcorrgfe: 0.085480 hartree
zpe.sumelectzpe: -395.970620 hartree
zpe.sumelectthermal: -395.962739 hartree
zpe.sumelectthermalent: -395.961795 hartree
zpe.sumelectthermalfe: -396.004397 hartree
dipole: 2.1397 -0.3574 -0.0666
dipole: 2.1704
quadrupole: -61.9342 -61.6759 -63.1542
quadrupole: 3.2451 4.2833 -7.9455
quadrupole: 0.3206 0.5788 -0.8994 3.2451 4.2833 -7.9455
hfenergy: -396.0898772 hartree
pointgroup: C01 [X(C6H7Br1O2)]
dipole: 0.8536302 -0.0207567 0.0011356 debye
dipolederiv: -0.6869616 -0.1122015 -0.0254762 -0.0604759 -0.1880501 0.0082377 0.0561327 0.0342308 -0.1384664 -0.2790203 0.1376365 0.0478987 0.0156834 -0.5179852 -0.0697869 -0.01411 -0.1815538 -0.5126898 -0.5285324 0.0665515 0.0759255 0.1680192 -0.3625696 -0.0806114 0.1430542 -0.1118083 -0.550321 0.1591508 -0.0448807 -0.043607 -0.075379 0.3594717 -0.0736342 -0.0863316 -0.0214087 0.210114 0.3467956 -0.0651226 0.0735911 -0.139585 0.0791238 0.0352323 0.0920369 0.1839021 0.165873 -0.0871512 -0.1424304 0.0250467 0.0442965 0.2671358 -0.0080826 0.1157498 0.0516069 0.2632452 0.4001739 0.0125567 -0.0228881 0.0156035 0.2038491 0.010605 -0.1104405 -0.0673287 0.2973382 1.0437077 0.1323554 -0.0364818 0.1467228 0.1003255 -0.0054074 -0.1431652 -0.031249 0.0922681 -0.2594088 0.0448601 -0.0238797 -0.0819161 0.0819221 0.059377 0.0976273 0.0577347 -0.0094687 -0.0128057 -0.0350131 0.0495436 -0.047805 -0.0715267 0.0834114 0.0274475 0.0577193 0.063527 -0.1013433 -0.0371136 -0.0762127 -0.0155843 0.0200973 -0.0315775 -0.0633622 -0.041416 0.0789946 0.042126 0.0654796 -0.0798371 0.0128027 -0.0068384 0.0578461 -0.0743584 0.0301319 -0.0001625 -0.0655609 0.0463873 -0.0619169 0.0600675 0.0154371 0.0934649 -0.0350988 0.0892202 -0.0063546 -0.0725974 -0.0050142 0.0450068 -0.0318169 0.0348557 -0.0261213 0.0102036 -0.0084436 -0.0205886 0.0497573 -0.0524381 0.0032074 -0.0377543 -0.1076536 0.0004703 -0.0268965 -0.0298493 0.0960169 0.0516704 -0.0116129 0.0500797 0.0271208 0.0924054 -0.0534235 0.0115111 -0.0114887 -0.0293254 unknown
polarizability: 109.1508806|7.9692877|70.7541909|-0.6371731|-2.7469446|56.9796809 unknown
InChI: InChI=1S/C6H7BrO2/c7-2-1-3-5(8-3)6-4(2)9-6/h2-6H,1H2
charge 0 multiplicity 1
16 atoms
Br -3.094151 -0.594953 -0.136966
O  -0.320154 1.655909 0.808455
O  1.79426 -0.910435 -0.830726
C  0.765461 1.349683 -0.218425
C  1.720983 0.257135 0.153849
C  -0.669375 0.995668 -0.501503
C  1.167674 -1.076231 0.54324
C  -1.074374 -0.461816 -0.464984
C  -0.340825 -1.294294 0.598844
H  1.187577 2.244506 -0.691555
H  2.699609 0.56708 0.538925
H  -1.241849 1.637486 -1.181695
H  1.762034 -1.708815 1.214811
H  -0.959171 -0.893515 -1.472118
H  -0.579816 -2.363107 0.459662
H  -0.689181 -0.9946 1.604187
