program: Gaussian 09
title: 000298085
version: EM64L-G09RevD.01
frameworkgroup: C1[X(C7H11ClN2O2)]
method: RPBEPBE
basis: SDD
operation: Freq
keyword: #p
keyword: freq=noraman
keyword: PBEPBE/SDD
title: #p freq=noraman PBEPBE/SDD
converged: YES YES NO NO
title: Mulliken charges:
elementType: Cl O O N N C C C C C C C H H H H H H H H H H H
charge: -0.048318 -0.216370 -0.240052 -0.206623 -0.417484 0.180218 0.164247 -0.673052 -0.674858 0.200145 -0.312571 -0.578114 0.326116 0.218776 0.234086 0.247939 0.218973 0.248231 0.231227 0.263180 0.265742 0.286429 0.282132
chargesum: 0.00000
title: Mulliken charges with hydrogens summed into heavy atoms:
elementType: Cl O O N N C C C C C C C
charge: -0.048318 -0.216370 -0.240052 -0.206623 -0.091368 0.180218 0.164247 0.027749 0.023574 0.200145 0.216350 -0.009552
polarizability: 1.33036120e+02 6.53517091e+00 1.00653966e+02 -6.25801565e+00 1.34798064e+00 7.28008915e+01
1716.lowfreq: -5.8033 -0.0026 -0.0021 -0.0015 0.9685 7.1564 32.4402 51.5432 75.2125
frequency: 31.7665 51.5196 75.1534 98.7386 134.5576 197.2182 203.9734 213.5825 230.8229 259.8945 283.3600 313.5529 329.2791 405.1795 438.8444 471.5814 564.4865 602.2907 620.0260 676.6699 696.9880 716.3794 745.8538 780.4664 879.6872 920.9821 936.5206 971.5969 1003.3867 1018.4962 1054.6015 1084.9748 1172.8697 1173.7859 1201.6425 1227.4928 1267.1148 1268.4948 1332.3905 1346.1150 1360.2137 1375.1969 1380.7622 1400.0941 1449.8313 1458.5942 1459.3783 1462.2925 1477.1834 1484.4534 1652.5183 1716.6968 2989.3835 2991.5479 3038.3008 3065.0282 3088.3878 3092.8798 3103.4459 3106.4688 3107.8724 3153.6031 3604.4007
redmass: 4.4533 4.7443 2.8446 4.8961 7.6546 1.1971 2.4319 6.6083 1.2748 2.6208 2.6392 2.4777 5.2910 5.7855 3.7831 1.1654 4.9226 7.7952 3.2266 7.5665 9.3923 5.8780 6.2160 1.2373 3.3545 2.2070 1.5021 1.8003 1.3049 2.0936 3.6978 1.7456 4.6046 4.1097 2.1213 1.8603 1.5392 1.7866 1.3526 2.7926 1.6234 1.1902 1.6973 1.3567 1.0881 1.0523 1.0931 1.0490 1.0668 1.0651 10.8960 9.9045 1.0349 1.0354 1.0592 1.0557 1.1008 1.1001 1.1010 1.1063 1.1005 1.1128 1.0800
irintensity: 0.2961 1.4705 1.3465 0.6777 3.1449 0.2934 1.0611 3.3858 1.9406 5.4700 4.5134 0.7756 23.0547 14.6912 1.8073 138.6605 27.9129 15.0522 2.1641 31.7105 8.5827 5.8607 19.2751 16.0626 3.0606 5.6175 2.3227 19.5133 0.8569 16.1077 1.1248 42.0040 18.9190 13.5345 8.3661 7.7918 41.4770 76.4352 54.3073 152.1614 5.7304 18.4586 96.3061 46.5146 24.9537 14.6341 11.1922 2.0712 8.3419 24.0953 502.3469 220.5922 15.5419 21.5325 4.8845 15.2979 8.1799 33.9185 8.4192 0.0875 20.3929 4.8523 50.3051
temp: 298.150 k
press: 1.00000 atm
elementType: 17 8 8 7 7 6 6 6 6 6 6 6 1 1 1 1 1 1 1 1 1 1 1
symmnumber: 1
zpe: 472649.8 jmol-1
zpe.correction: 0.180023 hartree
zpe.thermalcorrener: 0.192970 hartree
zpe.thermalcorrenthalpy: 0.193914 hartree
zpe.thermalcorrgfe: 0.139475 hartree
zpe.sumelectzpe: -992.473308 hartree
zpe.sumelectthermal: -992.460360 hartree
zpe.sumelectthermalent: -992.459416 hartree
zpe.sumelectthermalfe: -992.513856 hartree
dipole: -5.1317 0.0115 1.0286
dipole: 5.2338
quadrupole: -74.2955 -93.3229 -74.8803
quadrupole: -2.9664 -1.6719 -1.0623
quadrupole: 6.5374 -12.4900 5.9526 -2.9664 -1.6719 -1.0623
hfenergy: -992.6533304 hartree
pointgroup: C01 [X(C7H11Cl1N2O2)]
dipole: 2.0150835 0.1486292 -0.3967696 debye
dipolederiv: -0.6573876 -0.0748672 0.0051764 -0.0941512 -0.1717542 -0.0014187 0.0491342 0.007361 -0.19025 -0.5219973 -0.0995306 0.0354653 0.1242982 -1.0696053 0.0677786 0.0107961 0.0806746 -0.343736 -0.7620827 0.3113731 0.0588729 0.3417899 -1.1259095 -0.040189 0.0537551 -0.0131599 -0.3472448 -1.0389315 0.1867032 0.0353679 -0.033311 -1.3533799 0.0695358 -0.0026488 0.0122032 -0.2218309 -1.1676485 0.1725434 0.0782638 0.1780162 -0.4859094 -0.0478408 0.1189908 -0.0461568 -0.5735977 -0.0430512 -0.2050724 0.1000701 -0.3991699 0.3873962 0.0723446 0.1238952 0.0450216 0.3351657 1.0279991 -0.3653911 -0.1140869 -0.3697288 1.4219288 -0.0959128 -0.1324543 -0.0314327 0.1493008 0.0336503 0.0579571 -0.0570684 0.0266269 -0.0193692 -0.0184943 0.0146645 0.0351119 -0.0374567 0.0337527 0.0432309 0.0131861 0.0239097 -0.0263363 -0.0001399 -0.0427187 -0.059316 -0.0405599 1.5818978 -0.1623447 -0.2389983 -0.0469486 1.8507835 -0.035868 -0.2694394 -0.0693789 0.2860563 0.5365823 0.0701326 -0.0209806 0.104121 0.0909501 -0.0130576 0.0865322 0.0274541 0.1873207 0.7627393 0.0951097 -0.0511647 0.108442 0.1887564 -0.0171606 -0.0833417 -0.0372087 0.127191 0.1719217 0.0074966 0.0395431 0.0434118 0.1672066 0.0085477 0.0387834 0.0138632 0.358649 -0.1155819 -0.076301 0.0136162 -0.1007797 0.0532554 0.0313392 0.0448002 0.0461731 0.0601191 0.0673364 0.0359416 0.0714523 0.0202585 0.0708185 -0.0755942 0.0376071 -0.0571678 -0.089355 0.0760425 0.0139677 -0.0096125 0.0711581 -0.0828044 0.0173209 -0.0285163 -0.006462 0.099617 -0.1055136 -0.0832332 0.0676907 -0.1050095 0.0479923 0.0132282 0.0429816 -0.0103121 0.058899 0.0922455 0.02196 0.0110952 0.0686685 -0.0823824 -0.0161709 0.0199584 0.026276 0.0843716 0.0002233 0.0357736 -0.1205384 0.0345553 0.0841558 0.040268 -0.0894888 0.0191737 -0.0432761 0.0340697 0.0055598 -0.0187443 -0.0478186 0.0260453 0.0953183 -0.0178942 0.0468653 0.023371 0.0366285 0.0077896 0.0095165 0.0549123 0.0343787 -0.08112 -0.0138731 -0.0487356 0.0678949 -0.0318231 0.0418708 0.0585516 0.0099478 -0.0067948 -0.0722242 0.0273756 -0.0411375 0.0429397 -0.0110718 -0.0406695 0.033326 -0.0131989 0.0005777 0.0995094 0.011101 0.0602903 0.0064114 unknown
polarizability: 133.7265582|-4.1858281|100.0749201|-6.3337441|-0.4220427|72.6894995 unknown
InChI: InChI=1S/C7H11ClN2O2/c1-7(2)5(11)10(4-3-8)6(12)9-7/h9H,3-4H2,1-2H3
charge 0 multiplicity 1
23 atoms
Cl -4.432901 -0.68484 -0.142318
O  0.371885 -2.085256 0.312344
O  -0.524009 2.537322 0.151561
N  -0.416377 0.150333 0.312263
N  1.472792 1.274178 -0.177298
C  1.898865 -0.144812 -0.15084
C  0.553648 -0.849807 0.180722
C  2.926996 -0.427156 0.972399
C  2.42188 -0.625279 -1.526307
C  0.129775 1.468628 0.093824
C  -1.827905 -0.080277 0.644031
C  -2.637562 -0.389522 -0.626559
H  2.095826 2.057138 -0.365973
H  3.892392 0.057738 0.739706
H  2.566524 -0.047595 1.943897
H  3.090736 -1.514877 1.05819
H  3.387054 -0.14086 -1.760639
H  2.573033 -1.717913 -1.502739
H  1.703816 -0.385799 -2.329491
H  -1.888765 -0.929098 1.34586
H  -2.216637 0.830842 1.12864
H  -2.299712 -1.313513 -1.117399
H  -2.647053 0.458125 -1.326876
