program: Gaussian 09
title: 000298087
version: EM64L-G09RevD.01
frameworkgroup: C1[X(C10H15ClN2O2)]
method: RPBEPBE
basis: SDD
operation: Freq
keyword: #p
keyword: freq=noraman
keyword: PBEPBE/SDD
title: #p freq=noraman PBEPBE/SDD
converged: NO YES NO NO
title: Mulliken charges:
elementType: Cl O O N N C C C C C C C C C C H H H H H H H H H H H H H H H
charge: -0.051071 -0.213763 -0.241985 -0.448390 -0.204924 0.294741 -0.444341 -0.438338 -0.415312 -0.415196 -0.389367 0.108241 0.179793 -0.303495 -0.582195 0.217108 0.232919 0.233328 0.219390 0.194337 0.217416 0.217538 0.195897 0.204780 0.211175 0.325282 0.262727 0.262699 0.279710 0.291297
chargesum: 0.00000
title: Mulliken charges with hydrogens summed into heavy atoms:
elementType: Cl O O N N C C C C C C C C C C
charge: -0.051071 -0.213763 -0.241985 -0.123108 -0.204924 0.294741 0.005686 0.014380 -0.003559 -0.001762 0.026587 0.108241 0.179793 0.221932 -0.011187
polarizability: 1.76764442e+02 5.60373866e+00 1.20311627e+02 -4.64825397e+00 2.34261912e+00 9.85875740e+01
1716.lowfreq: -29.7506 -16.6767 -0.0018 -0.0012 -0.0006 4.0088 10.0449 31.7538 63.6897
frequency: -24.3127 30.4280 63.6613 85.1507 95.8231 130.5544 163.3723 203.6600 217.6046 256.1543 260.6731 273.1213 325.2060 364.9379 402.0091 416.5940 454.1227 483.1788 497.4063 574.7179 597.2423 666.0386 686.1401 687.7817 716.0321 744.5714 776.3925 779.0799 817.8801 846.7929 873.3706 913.0514 927.4188 944.7250 990.5326 998.6627 1052.3796 1056.0683 1061.7458 1066.8645 1099.5584 1119.6966 1137.5449 1158.5943 1196.9072 1208.5177 1236.4479 1257.8206 1262.5075 1272.8398 1280.7172 1318.7342 1322.1465 1334.6818 1336.8091 1345.1376 1345.6242 1354.1398 1363.2158 1383.2661 1448.0809 1454.6106 1456.8735 1459.7847 1469.2939 1472.0414 1479.8285 1647.9976 1712.5394 2964.6974 2967.2466 2977.3253 2990.5847 2994.0127 3035.0490 3035.2458 3038.2732 3044.9285 3054.5458 3060.4556 3067.2321 3102.7965 3157.1227 3610.0242
redmass: 3.3905 6.3041 3.5344 4.6855 3.6139 5.9324 5.6328 8.2887 2.2245 2.9046 2.6544 5.0811 5.3613 1.7901 2.9338 6.3774 1.2073 3.1226 1.7725 4.4609 7.3270 4.4009 6.5957 5.2954 6.5354 5.9170 1.2526 1.4747 3.0449 1.4911 3.3851 2.5773 1.3898 2.3557 1.8249 2.3217 2.3209 3.0735 1.5589 1.6054 1.6781 3.9957 1.5742 2.8669 1.7352 2.3175 1.7879 1.3507 1.1733 1.2099 1.7635 1.3698 1.4442 1.3759 1.4695 1.7322 1.5445 1.5786 1.6843 2.2215 1.0892 1.0841 1.0998 1.0864 1.0853 1.0820 1.0916 11.6318 9.9127 1.0661 1.0663 1.0613 1.0602 1.0611 1.0954 1.0591 1.0934 1.1026 1.1035 1.1034 1.0557 1.1062 1.1130 1.0797
irintensity: 0.4281 0.2563 1.2833 0.1921 0.1255 1.6194 4.1130 2.3314 1.5434 5.0636 0.5863 5.1363 24.5526 0.5831 2.1576 20.4605 83.2942 31.3537 3.7613 13.3752 26.0115 12.2305 9.9791 18.3825 12.9191 19.3793 12.0593 0.8908 1.8660 14.7942 2.8390 6.2123 10.0434 16.3954 27.6251 8.5358 0.6086 0.2332 0.5317 23.1386 0.3810 26.7750 3.5486 4.8887 0.7400 20.9932 29.3598 13.0898 15.6442 0.7311 29.5555 7.5593 66.0730 0.8970 30.9868 46.0060 12.1717 22.1999 9.2000 175.4792 28.7496 8.3343 19.1729 14.3509 8.3596 20.3190 6.4488 506.7344 260.8098 27.1365 32.9538 34.3781 15.7381 11.6230 54.5569 7.8287 53.0810 35.8324 9.3390 55.9718 14.6927 0.0386 4.6051 40.8497
temp: 298.150 k
press: 1.00000 atm
elementType: 17 8 8 7 7 6 6 6 6 6 6 6 6 6 6 1 1 1 1 1 1 1 1 1 1 1 1 1 1 1
symmnumber: 1
zpe: 643212.0 jmol-1
zpe.correction: 0.244987 hartree
zpe.thermalcorrener: 0.258784 hartree
zpe.thermalcorrenthalpy: 0.259728 hartree
zpe.thermalcorrgfe: 0.203491 hartree
zpe.sumelectzpe: -1108.971739 hartree
zpe.sumelectthermal: -1108.957942 hartree
zpe.sumelectthermalent: -1108.956998 hartree
zpe.sumelectthermalfe: -1109.013234 hartree
dipole: -5.7531 0.1550 0.7646
dipole: 5.8058
quadrupole: -99.0999 -110.5674 -92.5714
quadrupole: -3.2139 -0.7949 -1.7536
quadrupole: 1.6463 -9.8212 8.1748 -3.2139 -0.7949 -1.7536
hfenergy: -1109.2167256 hartree
pointgroup: C01 [X(C10H15Cl1N2O2)]
dipole: 2.2620305 -0.1291572 0.2897956 debye
polarizability: 177.0951509|3.8773811|120.0187877|4.1830124|-2.5246641|98.5497044 unknown
InChI: InChI=1S/C10H15ClN2O2/c11-6-7-13-8(14)10(12-9(13)15)4-2-1-3-5-10/h12H,1-7H2
charge 0 multiplicity 1
30 atoms
Cl -5.325091 0.642278 0.250011
O  -0.469602 2.087026 -0.532964
O  -1.459569 -2.482174 0.04493
N  0.581664 -1.251751 0.154529
N  -1.306954 -0.120841 -0.317855
C  1.036277 0.146934 -0.027882
C  1.703567 0.72845 1.252026
C  1.98296 0.304036 -1.256149
C  3.100702 0.11562 1.505828
C  3.376742 -0.311116 -0.994968
C  4.026269 0.281804 0.277435
C  -0.306911 0.860343 -0.316844
C  -0.778861 -1.430113 -0.024332
C  -2.726214 0.118312 -0.609898
C  -3.519171 0.326985 0.690462
H  1.038274 0.559666 2.119527
H  1.790945 1.822868 1.110309
H  2.078913 1.387429 -1.462787
H  1.509245 -0.160661 -2.141154
H  3.002363 -0.962367 1.753189
H  3.551607 0.595852 2.394579
H  4.023255 -0.134238 -1.874937
H  3.290075 -1.412924 -0.889756
H  4.225502 1.360622 0.115009
H  5.003349 -0.200725 0.468703
H  1.193277 -2.033866 0.37755
H  -2.79616 1.01551 -1.247903
H  -3.121587 -0.754772 -1.156175
H  -3.182194 1.215272 1.243787
H  -3.51387 -0.571163 1.323732
