program: Gaussian 09
title: 000298090
version: EM64L-G09RevD.01
frameworkgroup: C1[X(C11H14N2O4)]
method: RPBEPBE
basis: SDD
operation: Freq
keyword: #p
keyword: freq=noraman
keyword: PBEPBE/SDD
title: #p freq=noraman PBEPBE/SDD
converged: YES YES NO NO
title: Mulliken charges:
elementType: O O O O N N C C C C C C C C C C C H H H H H H H H H H H H H H
charge: -0.277166 -0.235843 -0.242634 -0.268897 -0.416968 -0.390319 0.085155 0.298988 -0.308430 0.134925 0.213964 -0.774057 0.129495 -0.767811 0.158432 -0.259933 -0.666867 0.248640 0.342864 0.220076 0.273229 0.266236 0.363798 0.213176 0.242419 0.268395 0.220322 0.232495 0.215280 0.251923 0.229112
chargesum: 0.00000
title: Mulliken charges with hydrogens summed into heavy atoms:
elementType: O O O O N N C C C C C C C C C C C
charge: -0.277166 -0.235843 -0.242634 -0.268897 -0.074104 -0.026521 0.085155 0.298988 -0.059790 0.134925 0.213964 -0.014516 0.129495 -0.043821 0.158432 0.192884 0.029448
polarizability: 2.62792525e+02 1.44571283e+01 1.43862444e+02 -3.43289810e+00 -2.58090863e+00 8.81257933e+01
1716.lowfreq: -5.0285 -0.0004 -0.0002 -0.0002 1.6772 3.2051 31.0034 34.8240 49.1790
frequency: 30.9906 34.7899 49.1773 71.7498 86.6350 95.8025 106.8149 135.1770 143.6092 169.7405 183.7523 193.7905 214.4293 255.8191 291.4071 323.1203 326.2259 344.4011 366.1488 429.1122 466.9629 488.7336 500.6642 509.0841 554.0074 594.9922 603.8882 644.2101 673.9917 696.2488 707.2470 736.0517 760.3357 776.2293 793.7462 817.7156 861.3941 917.3640 958.7287 985.9165 1006.3946 1014.9942 1036.4323 1043.6619 1063.9878 1090.2951 1098.2590 1155.3827 1159.6066 1218.2821 1265.2688 1269.1532 1279.1219 1352.7942 1357.2203 1373.2621 1382.8056 1390.3668 1402.5599 1409.2537 1452.7833 1455.0245 1457.1806 1462.9648 1463.7849 1466.7016 1485.1071 1485.5949 1577.8089 1589.4578 1620.5127 1652.1270 1682.2639 2992.3450 2992.7903 3001.4153 3027.4484 3077.5673 3087.1200 3087.9783 3090.2593 3092.4877 3101.3741 3111.1511 3118.2381 3527.7661 3551.9164
redmass: 4.6497 3.9087 6.0313 3.2973 1.1135 3.7136 3.9141 1.3819 2.8033 5.1682 3.3102 3.4827 1.8116 2.3989 3.0945 3.7149 4.2262 4.5171 8.7998 3.7198 3.0362 5.6233 5.0656 7.0204 3.6018 5.2768 5.3246 1.3555 3.6238 4.1700 2.3912 4.0343 2.6732 2.2697 4.4517 1.5259 3.1344 1.5556 2.9113 2.3953 2.4355 2.3759 1.5243 1.4771 2.1979 3.3426 2.3360 1.9426 3.7055 3.1080 6.2143 2.5443 1.1184 1.2955 1.9577 1.6441 2.2704 1.2317 1.2575 1.2290 1.0970 1.1063 1.0746 1.0643 1.2039 1.3528 1.0530 1.5671 7.2590 6.8583 7.2867 7.6474 5.4213 1.0380 1.0362 1.0367 1.0592 1.0964 1.0961 1.0973 1.0890 1.1036 1.0992 1.1006 1.1056 1.0771 1.0780
irintensity: 1.3804 0.8456 1.5149 2.3706 0.7159 1.4451 2.1613 0.5314 0.8745 5.2351 0.3150 2.3830 1.5914 0.2937 2.8942 9.1319 6.0886 5.4113 17.5562 8.4041 3.4530 28.9736 7.5532 17.9458 3.7367 2.0725 8.0836 60.6651 2.3180 12.4139 5.0659 38.7545 6.8741 133.6626 17.9622 1.8988 10.2525 16.5974 9.7695 4.2243 83.1734 14.3731 9.0711 2.8948 6.9581 427.0168 32.6047 29.1946 25.6305 300.6580 84.8040 94.8991 6.0592 10.9707 24.9323 16.4713 93.7631 26.1941 23.1400 56.4429 46.6677 46.5282 20.5119 21.7690 21.2332 18.5408 18.0781 35.9435 94.6948 138.5508 215.3638 147.3665 832.1388 13.9685 21.6950 10.5843 38.8156 11.2898 12.2002 39.9751 3.9918 0.3793 9.6966 14.2065 33.9676 62.1024 88.0658
temp: 298.150 k
press: 1.00000 atm
elementType: 8 8 8 8 7 7 6 6 6 6 6 6 6 6 6 6 6 1 1 1 1 1 1 1 1 1 1 1 1 1 1
symmnumber: 1
zpe: 633904.0 jmol-1
zpe.correction: 0.241441 hartree
zpe.thermalcorrener: 0.259143 hartree
zpe.thermalcorrenthalpy: 0.260087 hartree
zpe.thermalcorrgfe: 0.194481 hartree
zpe.sumelectzpe: -836.737832 hartree
zpe.sumelectthermal: -836.720130 hartree
zpe.sumelectthermalent: -836.719186 hartree
zpe.sumelectthermalfe: -836.784792 hartree
dipole: -0.8362 3.4643 1.5394
dipole: 3.8821
quadrupole: -101.8791 -95.9627 -100.8059
quadrupole: 13.8915 -1.5405 0.7993
quadrupole: -2.3298 3.5865 -1.2567 13.8915 -1.5405 0.7993
hfenergy: -836.979273 hartree
pointgroup: C01 [X(C11H14N2O4)]
dipole: 0.3677716 -1.3838976 -0.531329 debye
polarizability: 262.1485606|11.4738868|113.995173|12.7563774|28.2587689|118.6370293 unknown
InChI: InChI=1S/C11H14N2O4/c1-4-17-10(15)6(2)5-8-7(3)12-11(16)13-9(8)14/h5,12-13H,4H2,1-3H3
charge 0 multiplicity 1
31 atoms
O  3.781454 -0.268123 0.982386
O  -0.941316 1.781275 1.367435
O  -5.212876 0.071156 0.561058
O  3.000103 -0.696711 -1.172416
N  -3.357372 -0.991261 -0.397501
N  -3.036077 0.860144 0.988787
C  -1.081923 -0.274324 0.035413
C  -1.985949 -1.135284 -0.591495
C  0.3565 -0.425399 -0.220551
C  -1.611172 0.847556 0.843641
C  1.404781 -0.264696 0.653455
C  -1.559847 -2.269175 -1.496156
C  -3.965359 -0.003682 0.407441
C  1.296375 0.012782 2.134588
C  2.763162 -0.432501 0.037688
C  5.18182 -0.378376 0.472842
C  5.660748 0.96315 -0.089741
H  0.640796 -0.709314 -1.244719
H  -4.010472 -1.639888 -0.842148
H  -2.413429 -2.90233 -1.793481
H  -0.810927 -2.907061 -0.997808
H  -1.088772 -1.87953 -2.41739
H  -3.418985 1.625911 1.552292
H  0.330466 -0.336952 2.534232
H  2.118125 -0.477167 2.680855
H  1.352443 1.097879 2.332646
H  5.756325 -0.683513 1.362247
H  5.214758 -1.169791 -0.296554
H  6.726612 0.888633 -0.375429
H  5.081919 1.239845 -0.986592
H  5.559888 1.763644 0.663274
