program: Gaussian 09
title: 000298144
version: EM64L-G09RevD.01
frameworkgroup: C1[X(C28H22Si)]
method: RPBEPBE
basis: SDD
operation: Freq
keyword: #p
keyword: freq=noraman
keyword: PBEPBE/SDD
title: #p freq=noraman PBEPBE/SDD
converged: YES YES NO NO
title: Mulliken charges:
elementType: Si C C C C C C C C C C C C C C C C C C C C C C C C C C C C H H H H H H H H H H H H H H H H H H H H H H
charge: 1.393147 -0.191357 -0.176420 -0.173653 -0.176286 -0.508284 -0.308698 0.355060 -0.328290 -0.329694 -0.326793 -0.307125 -0.305355 -0.309189 0.375262 -0.432003 -0.250861 -0.249004 -0.252735 -0.237415 -0.236834 -0.236623 -0.424513 -0.408763 -0.232995 -0.233442 -0.233532 -0.247457 -0.242131 0.256059 0.250511 0.251466 0.250228 0.251431 0.250603 0.249724 0.250079 0.235005 0.229113 0.228877 0.229669 0.226932 0.227370 0.226950 0.242949 0.237799 0.228590 0.228572 0.228701 0.227925 0.227433
chargesum: 0.00000
title: Mulliken charges with hydrogens summed into heavy atoms:
elementType: Si C C C C C C C C C C C C C C C C C C C C C C C C C C C C
charge: 1.393147 -0.191357 -0.176420 -0.173653 -0.176286 -0.252225 -0.058187 0.355060 -0.076824 -0.079466 -0.075363 -0.056523 -0.055631 -0.059110 0.375262 -0.196998 -0.021747 -0.020127 -0.023067 -0.010483 -0.009464 -0.009673 -0.181564 -0.170963 -0.004405 -0.004869 -0.004831 -0.019533 -0.014699
polarizability: 3.87784243e+02 -1.59714684e+01 3.10031854e+02 -5.26899044e-01 1.28741759e+00 2.83937527e+02
1716.lowfreq: -5.0187 -3.8231 -0.0010 0.0004 0.0010 4.5614 12.9074 25.1766 30.2298
frequency: 12.4513 25.1032 30.1581 31.8304 36.9694 46.0943 52.1324 54.0581 57.4620 111.4574 141.8655 167.3309 180.8453 191.1851 194.6841 213.1205 224.7159 234.8169 248.0408 276.8385 378.1778 390.0262 392.9923 394.0972 397.4273 417.5410 435.5162 452.6862 479.2443 481.2130 503.5750 509.3478 521.6188 527.2740 594.2276 615.3784 615.7084 616.9922 635.6356 651.4928 672.9296 694.2222 696.6631 707.5334 708.8535 710.0156 748.4497 750.8684 753.0453 754.7473 758.9076 788.1718 836.0715 839.4150 863.2917 865.0337 868.6717 875.2529 924.4733 929.8868 931.1833 934.2606 936.4849 962.9883 982.8715 983.8801 985.1699 987.4378 987.7700 988.0432 988.5288 992.7074 999.8549 1000.3511 1001.0715 1021.8233 1022.4881 1023.3110 1023.6806 1074.2369 1074.7802 1077.4815 1088.5112 1097.3256 1100.7313 1102.1607 1133.3994 1169.5331 1172.3367 1173.2141 1173.2466 1173.3312 1197.7514 1198.6824 1200.8312 1228.0254 1253.3854 1278.9717 1310.4603 1311.2629 1315.3979 1335.7845 1363.8391 1364.6360 1365.6625 1394.8906 1417.7338 1418.4065 1419.5346 1421.1323 1426.9704 1455.1153 1470.2756 1471.3280 1471.9779 1503.7360 1570.7055 1575.5696 1576.3786 1577.2834 1591.7009 1596.3464 1596.7987 1597.3379 1633.2173 3104.1655 3110.1947 3111.8607 3112.2495 3116.9157 3117.9695 3118.2042 3118.5902 3119.4300 3124.9357 3129.4236 3129.5676 3130.1873 3140.7980 3141.3410 3141.4446 3141.7929 3142.0449 3158.4077 3158.6668 3159.1461 3161.1995
redmass: 4.2004 4.4623 5.0669 4.1503 4.8196 4.8645 4.8395 4.7571 4.3151 5.2341 5.2723 4.6672 3.7431 4.8667 5.4946 5.4857 5.2323 4.8204 5.1511 5.1046 4.4019 3.1030 2.7827 2.8121 2.8328 5.6764 5.0262 4.8915 2.5714 4.3643 4.7637 6.4978 5.8576 4.6047 7.2812 6.4543 6.4553 6.4796 6.9002 3.4568 6.6747 6.6506 6.3760 1.8201 1.8462 1.9413 1.6071 1.7750 1.6102 1.3960 4.5490 2.7659 1.3382 6.0228 1.2464 1.2470 1.2437 1.4741 1.5355 1.3553 1.4199 1.3654 4.1261 1.3720 1.4082 1.4279 1.4559 3.6225 5.2243 4.8945 1.6727 1.3491 1.3093 1.3072 1.3070 2.4040 3.0538 3.0286 3.0218 1.7353 1.7155 1.7112 2.5919 2.6202 2.7944 2.7795 1.6896 1.2556 1.0923 1.0575 1.0567 1.0568 1.1293 1.1306 1.1325 2.0921 1.4785 1.7996 1.4729 1.4656 1.4456 1.8413 4.3535 4.6898 4.7882 3.8908 2.1478 2.2300 2.3107 2.2988 5.7146 2.1341 2.0190 2.0133 2.0072 3.3611 6.4831 5.4467 5.5102 5.5443 5.6443 5.7811 5.7707 5.7785 6.6561 1.0910 1.0870 1.0868 1.0864 1.0866 1.0860 1.0861 1.0865 1.0855 1.0887 1.0911 1.0912 1.0914 1.0965 1.0960 1.0958 1.0958 1.0953 1.1015 1.1015 1.1015 1.1004
irintensity: 0.0155 0.0261 0.0474 0.0428 0.0419 0.0157 0.0426 0.0373 0.0435 0.8910 0.2744 1.2203 0.9921 1.2995 0.8238 2.4629 1.6535 0.4688 1.0443 0.2405 5.5151 0.2159 0.3039 0.1932 0.0904 12.8919 5.3790 11.0544 10.9809 32.7289 73.7111 14.7459 72.9768 44.0572 21.4925 0.2096 0.5086 1.4774 19.2324 6.2171 19.3181 16.5934 22.5420 81.8316 67.8645 23.3903 17.6572 28.6412 31.8855 44.4690 2.3330 0.1177 41.2066 6.6014 0.1607 0.4721 0.3328 15.9857 2.5347 0.0092 0.1464 0.0532 0.3352 2.6470 2.8135 0.3866 0.2651 3.1952 2.0676 0.8696 0.0047 0.1777 0.0323 0.0364 0.0326 9.9096 0.2318 3.3336 3.4330 2.4156 1.2693 0.2643 25.9013 25.8105 41.7840 44.6148 3.9502 9.9268 0.1746 0.3983 0.3717 0.2814 6.4009 6.9253 3.3305 5.1108 0.4476 11.2395 6.3534 4.3552 3.5891 8.6916 2.3390 1.1165 4.2510 0.4570 16.7163 9.3803 3.4281 21.0137 0.5694 0.5739 7.4382 8.6371 10.3694 15.9475 1.7667 0.6871 0.1210 1.8028 3.5810 0.1363 0.2212 0.1872 0.2383 10.9076 8.9383 4.8148 2.8708 2.1969 0.2064 0.5739 1.2104 4.6462 0.2530 4.8494 10.5318 2.8139 6.6309 18.7982 31.7982 62.3948 47.9132 53.5005 51.5386 22.5575 40.4171
temp: 298.150 k
press: 1.00000 atm
elementType: 14 6 6 6 6 6 6 6 6 6 6 6 6 6 6 6 6 6 6 6 6 6 6 6 6 6 6 6 6 1 1 1 1 1 1 1 1 1 1 1 1 1 1 1 1 1 1 1 1 1 1
symmnumber: 1
zpe: 1061396.8 jmol-1
zpe.correction: 0.404265 hartree
zpe.thermalcorrener: 0.428713 hartree
zpe.thermalcorrenthalpy: 0.429657 hartree
zpe.thermalcorrgfe: 0.346196 hartree
zpe.sumelectzpe: -1367.643680 hartree
zpe.sumelectthermal: -1367.619232 hartree
zpe.sumelectthermalent: -1367.618288 hartree
zpe.sumelectthermalfe: -1367.701748 hartree
dipole: 0.0303 0.0718 0.0124
dipole: 0.0789
quadrupole: -160.8326 -161.5347 -167.0520
quadrupole: -1.3117 0.5806 0.1667
quadrupole: 2.3072 1.6051 -3.9123 -1.3117 0.5806 0.1667
hfenergy: -1368.0479446 hartree
pointgroup: C01 [X(C28H22Si1)]
dipole: 0.0118893 -0.0255802 -0.0129744 debye
polarizability: 387.8697275|14.2681169|306.6945594|6.7483621|8.6747279|287.1893366 unknown
InChI: InChI=1S/C28H22Si/c1-4-14-25(15-5-1)29(26-16-6-2-7-17-26,27-18-8-3-9-19-27)28-21-20-23-12-10-11-13-24(23)22-28/h1-22H
charge 0 multiplicity 1
51 atoms
Si 0.857867 -0.020878 0.012691
C  -0.99426 0.404232 0.251841
C  1.904171 0.84427 1.363319
C  1.447933 0.594514 -1.702014
C  1.07109 -1.919179 0.141903
C  -1.995158 -0.432725 -0.268864
C  -1.398588 1.608179 0.930669
C  -3.389254 -0.119447 -0.141998
C  2.241515 2.222014 1.242343
C  2.832057 0.805295 -1.959153
C  0.351552 -2.662148 1.120243
C  2.332026 0.150798 2.52818
C  0.529003 0.811901 -2.764576
C  1.976391 -2.622322 -0.698843
C  -3.776044 1.098813 0.54049
C  -2.746166 1.944355 1.070388
C  2.975187 2.885556 2.251946
C  3.283112 1.214697 -3.234803
C  0.534213 -4.056985 1.258327
C  3.067067 0.809787 3.540648
C  0.974986 1.222374 -4.042085
C  2.162169 -4.017834 -0.565258
C  -4.41306 -0.975669 -0.669457
C  -5.16965 1.413119 0.668457
C  3.388176 2.180327 3.406367
C  2.354342 1.422648 -4.28108
C  1.443071 -4.738765 0.415987
C  -5.762842 -0.644109 -0.530605
C  -6.144211 0.560793 0.143926
H  -1.720951 -1.366444 -0.778841
H  -0.632554 2.264216 1.36042
H  1.941762 2.779249 0.345238
H  3.56362 0.663241 -1.153308
H  -0.369247 -2.150466 1.771047
H  2.101282 -0.915457 2.641466
H  -0.545015 0.67286 -2.59053
H  2.532275 -2.080005 -1.473366
H  -3.032893 2.863809 1.595537
H  3.225785 3.946444 2.136826
H  4.353405 1.373595 -3.41024
H  -0.032169 -4.608813 2.017404
H  3.390122 0.254797 4.429017
H  0.248553 1.38857 -4.845952
H  2.862936 -4.54024 -1.22675
H  -4.118514 -1.898026 -1.18455
H  -5.460158 2.3353 1.186255
H  3.958494 2.692175 4.190192
H  2.701459 1.742242 -5.270536
H  1.58553 -5.820681 0.519829
H  -6.537168 -1.304235 -0.936807
H  -7.206454 0.809257 0.24606
