program: Gaussian 09
title: 000003515
version: EM64L-G09RevD.01
frameworkgroup: C1[X(C15H18)]
method: RPBEPBE
basis: SDD
operation: Freq
keyword: #p
keyword: freq=noraman
keyword: PBEPBE/SDD
title: #p freq=noraman PBEPBE/SDD
converged: NO YES NO NO
title: Mulliken charges:
elementType: C C C C C C C C C C C C C C C H H H H H H H H H H H H H H H H H H
charge: -0.265466 0.220838 0.625227 0.250207 -0.578104 0.176234 0.277365 -0.451285 -0.495184 -0.693822 -0.693858 -0.391244 -0.334733 -0.810046 -0.818804 0.206122 0.205731 0.201837 0.235474 0.209629 0.228565 0.212877 0.228558 0.209786 0.212837 0.199055 0.240682 0.231396 0.221176 0.231708 0.235444 0.236994 0.234805
chargesum: 0.00000
title: Mulliken charges with hydrogens summed into heavy atoms:
elementType: C C C C C C C C C C C C C C C
charge: -0.059344 0.220838 0.625227 0.250207 -0.372374 0.176234 0.277365 -0.249448 -0.259709 -0.042752 -0.042677 -0.150562 -0.135678 -0.125767 -0.111561
polarizability: 2.29265833e+02 -1.83993092e+01 2.13501463e+02 2.60195036e-02 4.50317481e-02 9.28579210e+01
1716.lowfreq: -110.1732 -94.5575 -16.2319 0.0001 0.0004 0.0004 7.5956 13.2146 30.9063
frequency: -110.1653 -94.5493 29.4151 67.6131 106.3549 132.9655 144.7793 201.1347 223.1034 232.3926 250.4334 275.4508 278.7583 344.1181 371.2254 385.4929 390.2913 397.2375 470.6088 517.7719 530.1124 550.1168 619.2048 652.3271 656.3776 698.8106 738.3566 758.7909 799.7347 831.8079 862.4598 891.3798 902.3775 912.5137 939.3030 945.9244 951.1512 968.9628 975.5384 995.1558 1035.0374 1038.0688 1054.6563 1061.5341 1096.9160 1111.1774 1131.4440 1189.6043 1203.4805 1216.8566 1258.1565 1291.7181 1304.0676 1319.8561 1340.1123 1375.4154 1375.7782 1392.5880 1396.1796 1403.6682 1425.1129 1434.5632 1455.3792 1464.3664 1466.6031 1469.4355 1470.1303 1470.6875 1478.2429 1484.3585 1490.1452 1528.8338 1545.4620 1593.3972 1621.7868 2967.9722 2970.9573 2973.6864 2978.6718 2983.2553 3037.7945 3053.2868 3062.4655 3066.9517 3070.5570 3073.6734 3076.5616 3080.2118 3085.9866 3097.1774 3127.8341 3159.7638 3202.1041
redmass: 1.0272 1.0171 2.6181 3.3652 2.9907 3.3641 2.9967 1.2442 2.3892 1.3668 1.9748 3.3307 2.8171 3.0060 3.0645 4.9759 3.5752 3.1645 3.4771 3.1726 2.9653 3.0972 3.0722 2.8825 5.1512 3.8671 2.1507 5.4779 1.9942 1.3761 3.4301 2.5362 1.3726 1.1861 2.2139 1.5931 1.3587 3.2228 1.3526 1.7686 1.5089 1.5576 1.5783 1.5817 1.9094 2.5452 2.3109 2.2065 1.7060 3.8513 1.5883 1.5689 1.3259 2.7111 1.8173 1.6264 1.1941 1.2296 1.2175 1.2531 2.8236 2.7387 2.0775 1.0455 1.0497 1.0464 1.1530 1.0583 1.0538 1.0710 1.3676 3.3276 6.1736 6.3406 5.9252 1.0379 1.0350 1.0356 1.0840 1.0407 1.0976 1.0970 1.0998 1.0886 1.0942 1.0964 1.1005 1.0989 1.0863 1.0913 1.0949 1.0923 1.0992
irintensity: 0.9348 0.2064 0.0121 0.0158 2.0050 0.8983 0.2101 0.7322 2.7081 0.2093 0.0189 0.0076 1.1435 0.0620 3.7420 1.5509 1.0066 0.0682 0.6003 2.8642 3.9463 2.0859 0.5058 9.0626 0.4935 0.6615 16.1590 0.0951 35.3981 29.9507 8.8591 7.9705 0.9738 4.5398 2.1098 4.1078 1.1835 9.0738 0.4833 6.1560 9.1037 2.0254 3.4887 61.2767 0.2247 2.0432 3.7554 8.8576 0.7734 8.6091 23.3808 4.8092 0.9561 0.5710 8.7581 21.8476 16.3703 14.9527 31.2020 9.9021 3.5329 16.7446 27.2673 1.1885 0.3793 12.4642 10.6709 13.8232 21.7165 25.6419 4.8347 20.2157 26.7956 55.9646 12.5080 57.7493 30.3174 38.1786 16.6414 22.4635 23.4589 16.9826 1.6412 6.7511 124.8301 16.4377 23.2656 25.6675 42.9956 39.6726 14.1546 18.7782 15.7983
temp: 298.150 k
press: 1.00000 atm
elementType: 6 6 6 6 6 6 6 6 6 6 6 6 6 6 6 1 1 1 1 1 1 1 1 1 1 1 1 1 1 1 1 1 1
symmnumber: 1
zpe: 736081.9 jmol-1
zpe.correction: 0.280359 hartree
zpe.thermalcorrener: 0.294169 hartree
zpe.thermalcorrenthalpy: 0.295114 hartree
zpe.thermalcorrgfe: 0.239900 hartree
zpe.sumelectzpe: -581.274915 hartree
zpe.sumelectthermal: -581.261105 hartree
zpe.sumelectthermalent: -581.260160 hartree
zpe.sumelectthermalfe: -581.315374 hartree
dipole: 0.8911 -0.7446 -0.0032
dipole: 1.1612
quadrupole: -83.0482 -81.0051 -96.1045
quadrupole: 1.4602 0.0110 0.0136
quadrupole: 3.6711 5.7141 -9.3852 1.4602 0.0110 0.0136
hfenergy: -581.5552739 hartree
pointgroup: C01 [X(C15H18)]
dipole: -0.3790205 -0.2550804 0.0020742 debye
polarizability: 232.8871057|16.3807057|209.8791998|-0.0859054|-0.3429941|92.8589119 unknown
InChI: InChI=1S/C15H18/c1-10(2)13-7-5-11(3)14-8-6-12(4)15(14)9-13/h5-10H,1-4H3
charge 0 multiplicity 1
33 atoms
C  -3.159304 -0.125524 0.000259
C  0.65131 0.717948 -0.003868
C  -1.648039 -0.428468 0.000382
C  1.632772 -0.439854 -0.002136
C  -0.755218 0.672837 -0.002917
C  1.423453 1.92737 -0.006963
C  1.330427 -1.822994 0.001327
C  -1.253877 -1.791831 0.003783
C  2.933715 0.144959 -0.004243
C  -3.59952 0.642765 1.276134
C  -3.600114 0.634342 -1.280543
C  2.799095 1.558286 -0.00667
C  0.023343 -2.391074 0.004219
C  0.914805 3.349763 -0.010928
C  2.465353 -2.843628 0.004131
H  -3.689712 -1.098995 0.003598
H  -1.240391 1.66068 -0.004869
H  -2.088978 -2.509742 0.006292
H  3.881293 -0.39372 -0.003142
H  -3.122608 1.639695 1.326794
H  -3.321054 0.089453 2.190987
H  -4.695077 0.794091 1.279158
H  -3.323779 0.074028 -2.191775
H  -3.121493 1.630032 -1.338956
H  -4.695438 0.787568 -1.283347
H  0.007641 -3.49116 0.006989
H  3.62932 2.270773 -0.008216
H  1.284827 3.911679 0.868377
H  -0.187135 3.408404 0.005405
H  1.257725 3.897828 -0.909905
H  2.404065 -3.483656 0.904897
H  3.462211 -2.382561 -0.01629
H  2.38148 -3.513792 -0.872361
