program: Gaussian 09
title: 000298056
version: EM64L-G09RevD.01
frameworkgroup: C1[X(C9H10ClNO5S)]
method: RPBEPBE
basis: SDD
operation: Freq
keyword: #p
keyword: freq=noraman
keyword: PBEPBE/SDD
title: #p freq=noraman PBEPBE/SDD
converged: YES YES NO NO
title: Mulliken charges:
elementType: Cl S O O O O O N C C C C C C C C C H H H H H H H H H H
charge: 0.065014 0.992630 -0.407167 -0.496696 -0.496293 -0.180264 -0.161297 0.007751 -0.029141 -0.224057 -0.367160 -0.334520 -0.237633 0.553838 -0.671291 -0.159373 -0.320633 0.229093 0.221556 0.224015 0.221956 0.327793 0.299850 0.216551 0.231161 0.215065 0.279250
chargesum: 0.00000
title: Mulliken charges with hydrogens summed into heavy atoms:
elementType: Cl S O O O O O N C C C C C C C C C
charge: 0.065014 0.992630 -0.407167 -0.496696 -0.496293 -0.180264 -0.161297 0.007751 -0.029141 0.226593 0.078811 -0.006727 0.062218 0.553838 -0.008513 0.119877 -0.320633
polarizability: 2.36079790e+02 9.81847538e-02 1.54263390e+02 -1.04100174e+01 1.36883268e+01 1.16716150e+02
1716.lowfreq: -15.4323 -4.7331 -3.4823 -0.0022 -0.0011 -0.0004 7.3767 19.6156 31.2726
frequency: -14.0164 19.0167 31.2525 44.0988 46.5490 87.2483 100.2722 108.5468 131.3715 159.8729 186.1071 208.3774 211.3919 219.5629 225.6530 286.4716 292.9640 337.7376 351.6175 381.3041 398.3320 421.8178 442.4041 491.1118 523.3176 571.5641 588.4620 643.0234 676.6264 708.8920 733.2156 768.0073 807.5145 835.9427 840.8024 888.2237 893.8926 918.0926 925.8678 961.0516 979.1780 1019.2411 1041.7522 1072.2065 1111.4721 1117.9790 1138.7480 1145.5755 1205.4497 1221.3571 1244.2522 1278.0849 1303.7149 1355.1885 1363.0431 1381.7724 1392.8113 1398.4093 1440.5586 1473.2281 1476.4460 1479.7260 1489.8351 1572.2775 1587.7190 2982.0819 2984.2790 3010.3270 3045.0019 3064.6097 3087.1555 3090.2014 3163.5673 3168.6372 3182.0335
redmass: 3.2073 3.5741 5.4639 10.1699 3.4545 6.9815 5.9146 3.5110 5.0612 6.3046 15.1123 9.6421 1.6421 2.5316 7.2704 8.7266 8.1427 8.6927 5.6906 8.1179 6.9540 4.1023 9.2324 5.5971 7.3079 10.6844 7.2060 7.8530 6.1331 10.0647 5.0077 1.0753 10.6298 6.6916 1.4962 2.3771 1.1467 3.2227 1.5701 14.9964 1.3739 8.3887 3.0613 2.1821 3.4333 2.2561 1.3955 1.3685 12.7201 1.2912 1.3122 1.1022 1.3054 1.3506 3.8113 10.9453 1.1994 6.9287 2.5494 1.0603 1.0437 1.0654 1.0847 7.4263 8.1817 1.0476 1.0426 1.0593 1.1057 1.1043 1.0992 1.1042 1.0899 1.0929 1.0973
irintensity: 1.2285 0.7908 0.1250 0.2641 0.2458 3.2191 2.2615 4.3189 3.9894 0.3391 0.2727 7.9756 0.9622 1.2074 1.2270 4.3773 5.9413 9.2969 10.7153 3.3519 14.8355 1.8227 60.5146 27.7423 17.8180 112.8151 27.5307 15.5925 1.2066 23.6836 3.8991 7.2058 29.9820 111.2695 7.7095 61.5566 0.7095 54.0895 21.5979 72.9869 0.3992 70.4685 7.1822 21.0982 11.2786 45.7496 0.7964 8.6980 198.3039 0.6486 9.7833 0.2655 0.6453 3.8556 12.2557 30.9456 7.4916 62.4515 82.9814 11.8646 13.6566 3.4309 23.1641 20.5725 15.5878 3.0561 75.1700 21.9851 4.1176 0.2198 33.6269 69.5857 4.9538 16.9186 2.0770
temp: 298.150 k
press: 1.00000 atm
elementType: 17 16 8 8 8 8 8 7 6 6 6 6 6 6 6 6 6 1 1 1 1 1 1 1 1 1 1
symmnumber: 1
zpe: 481709.2 jmol-1
zpe.correction: 0.183473 hartree
zpe.thermalcorrener: 0.200983 hartree
zpe.thermalcorrenthalpy: 0.201927 hartree
zpe.thermalcorrgfe: 0.135132 hartree
zpe.sumelectzpe: -1636.389182 hartree
zpe.sumelectthermal: -1636.371673 hartree
zpe.sumelectthermalent: -1636.370729 hartree
zpe.sumelectthermalfe: -1636.437524 hartree
dipole: -1.8864 -1.8179 -3.8733
dipole: 4.6761
quadrupole: -112.3953 -120.1300 -118.4602
quadrupole: -18.1374 3.2234 2.6390
quadrupole: 4.5999 -3.1349 -1.4651 -18.1374 3.2234 2.6390
hfenergy: -1636.5726558 hartree
pointgroup: C01 [X(C9H10Cl1N1O5S1)]
dipole: -0.8556672 1.0359234 1.2566837 debye
polarizability: 233.9801579|4.0251668|158.6170349|18.3247939|4.084013|114.4621376 unknown
InChI: InChI=1S/C9H10ClNO5S/c1-2-5-16-17(14,15)7-3-4-8(10)9(6-7)11(12)13/h3-4,6H,2,5H2,1H3
charge 0 multiplicity 1
27 atoms
Cl 4.234149 1.021375 1.442894
S  -1.627393 0.702702 -1.247666
O  -2.492772 0.138525 0.298478
O  -2.079551 2.212859 -1.621354
O  -1.693082 -0.482177 -2.350548
O  2.251151 -2.712081 0.136459
O  4.201172 -1.53699 -0.038146
N  2.924123 -1.612469 0.075055
C  0.080737 0.76079 -0.472825
C  -3.922071 -0.2223 0.083815
C  -4.401172 -0.787099 1.429394
C  0.838491 -0.411936 -0.448222
C  0.534582 1.988749 0.035882
C  2.138129 -0.345973 0.102273
C  -5.891892 -1.192282 1.355945
C  1.822611 2.031036 0.604958
C  2.629374 0.870869 0.64212
H  -3.996975 -0.981453 -0.718669
H  -4.495264 0.681797 -0.198406
H  -3.778627 -1.660765 1.695458
H  -4.250183 -0.024502 2.215244
H  0.463726 -1.35856 -0.8498
H  -0.095513 2.881761 -0.019793
H  -6.061747 -1.966917 0.585644
H  -6.226036 -1.601661 2.325516
H  -6.534646 -0.325352 1.115818
H  2.208678 2.961757 1.02928
