program: Gaussian 09
title: 000298071
version: EM64L-G09RevD.01
frameworkgroup: C1[X(C15H26O)]
method: RPBEPBE
basis: SDD
operation: Freq
keyword: #pfreq=noraman
keyword: PBEPBE/SDD
title: #p freq=noraman PBEPBE/SDD
converged: YES YES NO NO
title: Mulliken charges:
elementType: O C C C C C C C C C C C C C C C H H H H H H H H H H H H H H H H H H H H H H H H H H
charge: -0.453351 0.321849 -0.085117 0.337363 -0.179009 -0.479327 -0.439406 -0.549779 -0.449367 -0.825795 0.422034 -0.776640 -0.778513 -0.427496 -0.446917 -0.822376 0.195450 0.229322 0.188319 0.197452 0.190786 0.194566 0.218066 0.219889 0.196193 0.205761 0.245766 0.220461 0.213450 0.214993 0.208360 0.222450 0.215932 0.211265 0.214219 0.208437 0.206155 0.205068 0.212208 0.245569 0.213849 0.337861
chargesum: 0.00000
title: Mulliken charges with hydrogens summed into heavy atoms:
elementType: O C C C C C C C C C C C C C C C
charge: -0.115490 0.321849 0.110333 0.337363 0.050312 -0.093555 -0.054055 -0.111824 -0.047413 -0.146118 0.422034 -0.130838 -0.137098 -0.219059 -0.035694 -0.150750
polarizability: 1.88026185e+02 -6.47737006e+00 1.58466324e+02 -1.51471553e+00 8.88271511e-01 1.28784736e+02
1716.lowfreq: -16.2221 -9.8074 -0.0003 0.0001 0.0005 9.3570 54.7710 73.4213 90.0585
frequency: 54.6632 73.2075 90.0355 115.1481 123.3001 170.1142 182.1438 218.0377 224.3818 233.7282 243.4321 265.1897 267.0711 282.2944 285.1741 295.9713 302.5645 315.6333 341.0370 347.6631 374.4368 405.5224 417.3024 434.6123 472.8120 497.6568 534.1858 555.6461 630.0968 646.7100 708.1273 763.1082 767.3152 812.6139 834.4229 854.5320 872.1838 904.3708 918.8214 927.3562 947.6378 953.0729 961.7649 975.0820 977.2197 985.6141 1023.5180 1030.7342 1041.4099 1052.3120 1056.2320 1077.0697 1085.0859 1106.4250 1116.8941 1139.8445 1165.5612 1175.8813 1187.2953 1196.1047 1202.0069 1212.5564 1222.2537 1228.4713 1257.2840 1266.1986 1295.5832 1299.3561 1311.0442 1328.2764 1332.0866 1339.1942 1348.9368 1350.8237 1358.7969 1370.2760 1385.5685 1392.7791 1400.9253 1407.0556 1450.3165 1452.6369 1456.3919 1460.3321 1461.6243 1467.1970 1470.2482 1474.9003 1478.5665 1480.5538 1481.9926 1492.4906 1495.4775 1687.1624 2918.6244 2937.5778 2950.7730 2952.0281 2954.4852 2956.2919 2965.5552 2972.0945 2977.9645 2980.9128 2984.6359 3007.1605 3007.7335 3010.9231 3017.8552 3035.5727 3049.7046 3055.3297 3062.4354 3066.2367 3068.9226 3075.8089 3083.8928 3086.4672 3104.1336 3559.5595
redmass: 3.0170 2.5711 3.2920 1.5186 1.8780 1.5285 1.1102 1.4765 1.3521 1.7409 1.4858 2.4237 2.1976 2.5598 2.1807 2.3402 2.7240 2.3285 3.0934 3.2955 2.2422 2.8137 2.3016 3.1001 2.5012 2.9897 2.1512 2.6751 3.2980 2.8278 3.1391 2.2303 2.6368 1.5481 1.9105 1.6530 2.2375 1.9294 1.7776 1.5216 3.3131 2.0415 1.6894 1.5999 1.8758 1.7689 1.6651 1.7548 1.9604 1.9266 1.7430 2.0787 1.6644 2.2494 1.7275 1.6570 1.7133 2.1059 2.0170 1.4548 1.6098 1.6820 1.7985 1.3734 1.6739 1.6683 1.4116 1.2992 1.5418 1.3981 1.6318 1.4467 1.6768 1.5763 1.3618 1.2195 1.2349 1.2083 1.2445 1.3143 1.0685 1.0664 1.0801 1.0731 1.0572 1.0615 1.0752 1.0649 1.0715 1.0687 1.0573 1.0594 1.0581 6.9908 1.0818 1.0779 1.0603 1.0616 1.0606 1.0617 1.0360 1.0361 1.0407 1.0598 1.0412 1.0963 1.1010 1.0998 1.0958 1.1020 1.0957 1.0990 1.0973 1.0959 1.0980 1.1003 1.0985 1.0908 1.0951 1.0664
irintensity: 0.3275 0.0703 2.4289 1.0293 1.8451 1.0130 2.9367 5.5160 48.4003 35.7819 41.2825 1.0864 4.8201 0.9428 4.8750 2.5212 0.7097 0.9213 0.2871 3.7882 1.0086 2.1576 2.3641 1.7919 0.6515 1.4590 0.7249 6.4054 3.4254 2.8102 0.9088 5.0906 0.0251 10.3171 14.8188 4.5108 0.1995 4.9066 1.9250 3.1579 58.8153 5.6055 1.5962 8.7772 9.9656 3.1498 2.4349 9.0272 9.9564 0.8944 5.7142 11.6645 0.7367 1.6002 8.8400 5.2371 3.5269 4.4095 0.5533 3.9749 5.4461 13.6695 6.4722 18.6511 4.2204 21.3424 0.5213 0.6353 2.2919 0.8449 3.0131 1.7521 0.8172 0.5905 3.0502 13.3559 28.8965 23.7153 15.7329 1.6346 4.6581 8.1751 3.7580 3.3050 7.3617 16.8045 6.9768 18.0281 12.2068 4.8511 11.2036 9.3471 8.3955 2.2030 11.6786 1.7682 32.4078 24.9292 17.7311 86.0363 41.5098 42.9760 31.5653 30.5575 37.2022 25.1625 69.7502 16.5210 93.4714 62.1202 25.1517 24.7071 76.4520 19.4064 50.2468 17.8485 33.6218 62.1873 30.4819 1.4943
temp: 298.150 k
press: 1.00000 atm
elementType: 8 6 6 6 6 6 6 6 6 6 6 6 6 6 6 6 1 1 1 1 1 1 1 1 1 1 1 1 1 1 1 1 1 1 1 1 1 1 1 1 1 1
symmnumber: 1
zpe: 986796.1 jmol-1
zpe.correction: 0.375851 hartree
zpe.thermalcorrener: 0.393445 hartree
zpe.thermalcorrenthalpy: 0.394389 hartree
zpe.thermalcorrgfe: 0.332961 hartree
zpe.sumelectzpe: -661.103991 hartree
zpe.sumelectthermal: -661.086397 hartree
zpe.sumelectthermalent: -661.085453 hartree
zpe.sumelectthermalfe: -661.146881 hartree
dipole: -0.0508 -1.1448 1.1998
dipole: 1.6591
quadrupole: -96.6637 -97.4840 -103.5563
quadrupole: -4.9719 4.9975 -1.4035
quadrupole: 2.5710 1.7507 -4.3217 -4.9719 4.9975 -1.4035
hfenergy: -661.4798422 hartree
pointgroup: C01 [X(C15H26O1)]
dipole: -0.0371122 0.4606938 -0.4609492 debye
polarizability: 187.3232982|7.7760126|159.0692162|2.167616|1.7850102|128.8847309 unknown
InChI: InChI=1S/C15H26O/c1-11-6-7-13-14(2,3)8-5-9-15(13,4)12(11)10-16/h6,12-13,16H,5,7-10H2,1-4H3
charge 0 multiplicity 1
42 atoms
O  3.591393 1.551767 0.820728
C  0.085348 0.601217 -0.274323
C  -0.814175 -0.5823 0.259455
C  -2.383912 -0.398234 0.202468
C  1.543448 0.346459 0.286857
C  -0.448032 1.94672 0.310943
C  -2.752301 1.003907 0.775147
C  -0.33959 -1.929076 -0.336616
C  -1.964644 2.152853 0.116455
C  0.141101 0.67214 -1.826314
C  2.030114 -1.097014 0.073671
C  -3.015155 -0.561485 -1.209806
C  -3.041887 -1.467392 1.123899
C  1.158857 -2.101354 -0.221601
C  2.564047 1.388227 -0.230014
C  3.508328 -1.396029 0.259923
H  -0.585714 -0.626279 1.349857
H  1.501777 0.526236 1.385078
H  0.097316 2.800647 -0.13723
H  -0.230033 1.970455 1.400221
H  -2.541171 1.011523 1.865958
H  -3.843824 1.164478 0.661854
H  -0.649701 -2.019565 -1.399249
H  -0.835577 -2.768659 0.189072
H  -2.265372 3.120175 0.564627
H  -2.209798 2.22151 -0.961505
H  0.591815 -0.241283 -2.252491
H  -0.856518 0.800001 -2.275474
H  0.75421 1.532673 -2.154737
H  -2.748975 0.25659 -1.899846
H  -4.118418 -0.567568 -1.118606
H  -2.718575 -1.513987 -1.684167
H  -2.951435 -2.487386 0.70836
H  -4.121371 -1.254017 1.244046
H  -2.583023 -1.465884 2.131012
H  1.553198 -3.118346 -0.364484
H  2.063185 2.360644 -0.405386
H  3.027792 1.055244 -1.18218
H  3.705554 -2.475445 0.13133
H  3.850708 -1.086662 1.264555
H  4.14367 -0.842451 -0.457037
H  4.271638 2.201648 0.511149
