program: Gaussian 09
title: 000026843
version: EM64L-G09RevD.01
frameworkgroup: C1[X(C9H8N2)]
method: RPBEPBE
basis: SDD
operation: Freq
keyword: #p
keyword: freq=noraman
keyword: PBEPBE/SDD
title: #p freq=noraman PBEPBE/SDD
converged: NO NO NO NO
title: Mulliken charges:
elementType: N N C C C C C C C C C H H H H H H H H
charge: -0.089022 -0.044680 0.282408 0.331092 -0.042229 -0.368615 -0.297209 -0.802258 -0.463763 -0.234643 -0.215489 0.245307 0.264933 0.240016 0.235978 0.240026 0.249012 0.232644 0.236491
chargesum: 0.00000
title: Mulliken charges with hydrogens summed into heavy atoms:
elementType: N N C C C C C C C C C
charge: -0.089022 -0.044680 0.282408 0.331092 -0.042229 -0.123308 -0.032276 -0.086237 -0.214751 -0.001999 0.021002
polarizability: 1.54523859e+02 4.33891287e+00 1.20588801e+02 1.93291009e-03 2.45366203e-03 4.87451320e+01
1716.lowfreq: -3.3278 -2.6246 -0.0006 -0.0003 0.0005 13.7637 127.5456 157.1957 181.8814
frequency: 127.5206 157.1669 181.8803 226.2675 257.6304 409.0188 431.7378 465.4287 469.1077 519.8716 540.6741 561.6191 650.0091 690.0196 774.8037 792.1874 801.9080 858.9252 882.9170 897.3683 974.6878 980.1055 1004.0648 1015.1024 1041.9603 1062.4364 1076.7721 1122.1773 1155.2847 1184.4383 1225.9559 1264.2043 1294.1484 1388.2769 1395.7584 1407.7782 1440.9351 1466.5824 1467.2550 1498.6000 1520.1181 1562.2040 1621.2212 2978.5957 3055.7534 3094.8571 3131.1063 3144.3942 3146.0256 3158.7240 3173.4697
redmass: 3.4386 1.4066 2.1795 4.0422 3.0461 3.1912 4.2005 3.8360 5.9439 6.2857 3.3239 7.2860 4.1130 5.5433 1.2959 3.4715 5.9018 6.0430 1.5614 1.2971 1.3566 1.9795 1.3305 2.4259 1.5761 4.4360 2.6496 2.2474 2.1561 1.2909 4.2616 1.6323 1.5865 2.7413 1.3741 2.2303 3.2864 1.0459 1.2244 3.4633 4.0437 5.7580 6.2764 1.0377 1.0971 1.0986 1.0856 1.0899 1.0923 1.0959 1.0995
irintensity: 1.4130 0.3644 2.6398 2.4575 0.9556 5.1032 2.1405 1.6440 0.8852 0.0849 3.0233 1.1423 0.7906 2.5581 92.2504 0.7417 1.2798 0.4890 1.6721 15.9205 2.3531 3.3291 0.1451 5.7508 6.9549 1.9996 1.1516 7.3719 13.1178 2.4589 4.2456 0.3709 6.5280 2.2665 5.6172 26.5520 14.1684 16.5435 13.2759 13.8267 4.7168 16.2871 2.6958 17.8359 14.3000 17.0900 0.5316 6.4114 20.5576 18.8009 17.6377
temp: 298.150 k
press: 1.00000 atm
elementType: 7 7 6 6 6 6 6 6 6 6 6 1 1 1 1 1 1 1 1
symmnumber: 1
zpe: 387285.3 jmol-1
zpe.correction: 0.147509 hartree
zpe.thermalcorrener: 0.155976 hartree
zpe.thermalcorrenthalpy: 0.156920 hartree
zpe.thermalcorrgfe: 0.114260 hartree
zpe.sumelectzpe: -456.465517 hartree
zpe.sumelectthermal: -456.457050 hartree
zpe.sumelectthermalent: -456.456106 hartree
zpe.sumelectthermalfe: -456.498766 hartree
dipole: 1.3957 5.2620 0.0002
dipole: 5.4440
quadrupole: -53.9329 -68.9465 -66.9366
quadrupole: -7.2896 -0.0001 -0.0001
quadrupole: 9.3391 -5.6745 -3.6646 -7.2896 -0.0001 -0.0001
hfenergy: -456.6130259 hartree
pointgroup: C01 [X(C9H8N2)]
dipole: -0.779324 -1.9950012 0.0000937 debye
dipolederiv: -0.0754389 0.2702784 -0.0000113 0.0179682 -0.0884058 -0.0000003 -0.0000037 -0.0000074 -0.2305107 -0.2363716 -0.2464281 0.0000048 0.0827127 0.1168561 -0.0000122 -0.0000012 -0.0000041 -0.2416618 0.0221918 0.0664566 -0.0000045 0.3185452 -0.2082188 0.0000019 -0.0000091 0.0000096 0.0606855 0.0045994 0.0065442 0.0000067 -0.2693087 0.4524604 -0.0000275 0.0000296 -0.0000512 0.0280451 0.0933081 -0.0212883 0.0000019 -0.2089877 -0.1504849 0.0000094 0.0000019 0.0000072 0.1279636 -0.1882827 0.0064681 0.0000013 -0.0353841 0.0834164 -0.0000116 0.0000015 -0.0000051 -0.1796461 -0.0667634 0.0210788 -0.0000011 -0.0954092 0.1448258 -0.0000045 -0.0000004 -0.0000097 -0.1192204 0.0772182 -0.0054398 -0.0000082 0.1033584 -0.1997708 0.0000196 -0.0000361 0.0000717 0.0274501 0.247452 -0.1297996 0.0000017 0.0350013 -0.3451155 0.000013 -0.0000035 0.0000137 -0.024214 0.0478595 0.0892736 -0.000008 0.0815262 0.1573814 -0.0000063 -0.0000078 -0.0000118 -0.1300048 0.1211312 -0.1378974 -0.0000014 -0.0982004 -0.0983068 -0.0000005 -0.0000003 0.0000027 -0.1618947 0.0774024 0.0600312 0.0000004 0.0077723 -0.0860338 0.000007 -0.0000018 0.0000047 0.1525666 0.0914843 0.0027448 0.0000015 0.06401 -0.0293142 0.0000034 -0.0000003 0.0000052 0.1609722 0.072872 -0.034448 -0.0867436 0.0085522 0.0072428 -0.069908 -0.0432554 -0.09803 -0.0258839 -0.1417021 0.0668349 0.0000449 -0.0481778 0.0888597 0.0000085 0.0000453 -0.0000159 0.1143895 0.0729285 -0.0343804 0.0867008 0.0085963 0.0072611 0.0699027 0.0432267 0.0980147 -0.0259696 -0.0852025 0.057805 0.000004 0.0810072 0.0752051 -0.0000022 0.0000037 -0.0000017 0.1487447 -0.0273905 -0.0995946 0.0000069 -0.1073797 -0.0027762 0.0000064 0.0000078 0.0000061 0.1583269 -0.1072957 0.0617605 0.0000034 0.0537977 0.0749179 0.0000012 0.0000032 0.0000014 0.1598619 unknown
polarizability: 155.0647642|0.4218247|120.047896|-0.0021976|-0.0022198|48.745132 unknown
InChI: InChI=1S/C9H8N2/c1-7-6-10-11-9-5-3-2-4-8(7)9/h2-6H,1H3
charge 0 multiplicity 1
19 atoms
N  0.637615 1.905746 -0.000103
N  1.942611 1.559493 -0.000127
C  -0.005199 -0.521114 -0.000029
C  1.391738 -0.862823 -0.00005
C  -0.329071 0.891053 -0.000052
C  -1.076491 -1.473456 0.000015
C  -1.699002 1.309995 -0.000032
C  1.874019 -2.295343 0.000004
C  2.293674 0.211741 -0.000106
C  -2.403994 -1.040214 0.000036
C  -2.719301 0.358857 0.000011
H  -0.84715 -2.544554 0.000037
H  -1.898559 2.386143 -0.000055
H  1.508803 -2.842825 -0.889495
H  2.975618 -2.341796 -0.000206
H  1.509163 -2.842621 0.88978
H  3.375668 0.041613 -0.000126
H  -3.218231 -1.773471 0.000074
H  -3.76781 0.675677 0.000021
