program: Gaussian 09
title: 000298045
version: EM64L-G09RevD.01
frameworkgroup: C1[X(C19H25NO2)]
method: RPBEPBE
basis: SDD
operation: Freq
keyword: #p
keyword: freq=noraman
keyword: PBEPBE/SDD
title: #p freq=noraman PBEPBE/SDD
converged: YES YES NO NO
title: Mulliken charges:
elementType: O O N C C C C C C C C C C C C C C C C C C C H H H H H H H H H H H H H H H H H H H H H H H H H
charge: -0.353121 -0.278304 -0.473075 0.376542 -0.444002 -0.373841 -0.349957 -0.748970 -0.737859 -0.358812 -0.696684 0.275015 0.323412 0.156481 0.433932 -0.381732 -0.338540 -0.472308 -0.233605 -0.425381 -0.274286 -0.243790 0.197655 0.253864 0.204955 0.196123 0.183319 0.196869 0.239636 0.207177 0.225076 0.267237 0.212377 0.221131 0.198333 0.192276 0.215082 0.212441 0.208733 0.331213 0.300561 0.193306 0.237830 0.226623 0.238982 0.228273 0.229814
chargesum: 0.00000
title: Mulliken charges with hydrogens summed into heavy atoms:
elementType: O O N C C C C C C C C C C C C C C C C C C C
charge: -0.353121 -0.278304 -0.141862 0.376542 0.007516 0.027237 0.030231 -0.077082 -0.037115 0.031798 -0.060428 0.275015 0.323412 0.156481 0.433932 -0.081172 -0.145234 -0.234478 -0.006982 -0.186398 -0.046014 -0.013975
polarizability: 2.89758332e+02 -3.93798294e+01 1.70275207e+02 1.82555739e+01 1.52644365e+01 2.31407701e+02
1716.lowfreq: -6.4686 -6.1232 -0.0007 -0.0006 -0.0002 8.1867 11.6840 16.8261 32.6832
frequency: 10.9438 16.7483 32.3786 47.9200 69.1453 73.3784 85.3110 98.7882 116.7072 125.9121 152.9530 172.3845 177.1526 196.1952 212.9867 223.9180 229.9227 241.2526 264.8281 272.1652 303.2404 330.1823 335.0801 399.3276 418.2985 420.9758 432.8917 448.9055 471.8036 507.5439 513.5181 526.5890 558.4501 599.7567 627.4448 646.6680 687.3692 702.9631 712.0006 725.1881 739.4654 752.4838 782.0571 782.9122 795.8406 807.3111 826.6237 849.4940 869.2862 870.8496 896.3389 920.0192 922.0152 929.5151 951.0022 958.5634 966.3282 984.4255 991.4155 997.3119 1021.0481 1033.1131 1058.0868 1061.0319 1075.9565 1078.5320 1094.7564 1109.0436 1142.1237 1154.7923 1175.9200 1182.2616 1194.7809 1197.4474 1217.0209 1235.7879 1244.3653 1253.5807 1272.2830 1279.2133 1288.2945 1289.0357 1301.6054 1318.7744 1351.4647 1361.2492 1365.1655 1377.2439 1388.8643 1394.7567 1409.1209 1419.8226 1443.3512 1448.8754 1454.3782 1460.8652 1464.6260 1469.2212 1470.0424 1473.0069 1477.1184 1480.4848 1488.0928 1490.7746 1493.4547 1538.9739 1592.0036 1598.3615 1634.4520 1652.1539 2953.8562 2964.4444 2971.5902 2972.1304 2978.3355 2989.6008 2994.2442 2995.9852 3016.0851 3035.9580 3061.7700 3068.6851 3070.9722 3081.4513 3094.0071 3102.1196 3112.4366 3112.5548 3124.5785 3129.3987 3142.7626 3153.5814 3163.3444 3191.2975 3566.7699
redmass: 4.4327 4.0737 1.8078 3.9145 5.5321 4.2910 2.9239 3.3538 1.9760 3.1011 3.4724 2.4689 4.0373 1.1880 3.2770 3.6526 1.1722 1.1660 3.0968 3.8265 5.9169 3.4139 2.5931 3.2424 2.9555 3.5557 3.0007 2.9984 3.3708 6.0316 6.3594 3.1094 2.3927 5.6298 1.5582 3.2873 5.8318 6.3706 7.2367 1.0749 1.2897 1.1753 5.5633 2.0316 3.7458 1.4397 1.6585 2.3592 1.8728 4.7714 1.8490 1.6141 1.3593 1.5093 1.4020 3.7187 1.6075 1.3318 1.3588 1.5988 2.3832 2.8636 2.1670 2.4784 2.2584 1.6465 2.2992 2.1864 2.3962 1.4366 2.2254 1.1276 1.3106 1.8407 1.7574 1.9010 1.9088 1.4521 1.6432 1.3909 1.8757 1.2066 1.3283 1.3826 1.5843 1.5180 2.2972 1.2253 1.2162 1.2334 2.7745 5.5926 2.5601 1.0618 2.2665 1.0832 1.0684 1.0602 1.0713 1.0523 1.0430 1.0753 1.0956 2.2242 1.1055 2.8742 7.3589 5.3276 6.4461 6.6510 1.0591 1.0594 1.0483 1.0475 1.0649 1.0368 1.0940 1.0387 1.1001 1.1014 1.0991 1.1006 1.0993 1.0992 1.0993 1.0998 1.0862 1.0997 1.0876 1.0867 1.0939 1.0967 1.1003 1.0942 1.0748
irintensity: 0.0705 0.0122 0.1121 1.5931 3.1457 0.5164 0.1318 1.6232 0.0451 0.2291 0.9636 1.8694 2.7339 0.6997 0.5992 2.4073 0.0636 0.1874 0.3880 3.9189 10.5396 5.0382 4.7946 0.5399 10.4248 1.2994 8.1124 1.8022 0.0912 0.1800 0.0311 1.2653 0.0559 1.7747 31.3927 5.7628 9.3129 42.7397 8.5232 12.3377 24.1921 0.5691 2.4358 71.5298 5.2378 72.5434 3.9768 36.4694 17.0396 0.3902 6.9047 2.6212 2.6158 10.3217 1.8319 110.8526 58.1469 1.1067 4.2613 0.8683 4.5840 43.6735 77.0931 55.5478 6.6017 27.8835 21.6627 14.5564 589.6345 12.2030 32.1001 8.4303 2.8187 7.2248 6.1345 3.4832 31.7065 4.2281 24.2742 1.5941 16.2131 3.3707 14.1730 19.0469 0.7847 9.5961 63.0126 39.0830 11.5113 36.2629 35.5282 99.2141 3.5595 2.6728 2.5074 36.3790 5.7559 4.1398 3.7698 1.8515 12.8510 6.4130 28.8049 303.4434 110.5501 369.7936 48.4535 11.8929 13.2877 175.0117 6.5168 20.0091 61.5443 20.6050 48.0146 24.3567 4.3829 27.2405 1.0884 54.5255 21.6259 102.4910 52.8744 17.9552 54.1200 27.4165 16.0317 14.0281 0.9174 2.0335 32.4801 33.8186 28.7958 4.6437 26.9333
temp: 298.150 k
press: 1.00000 atm
elementType: 8 8 7 6 6 6 6 6 6 6 6 6 6 6 6 6 6 6 6 6 6 6 1 1 1 1 1 1 1 1 1 1 1 1 1 1 1 1 1 1 1 1 1 1 1 1 1
symmnumber: 1
zpe: 1042588.5 jmol-1
zpe.correction: 0.397101 hartree
zpe.thermalcorrener: 0.419753 hartree
zpe.thermalcorrenthalpy: 0.420697 hartree
zpe.thermalcorrgfe: 0.342611 hartree
zpe.sumelectzpe: -942.615583 hartree
zpe.sumelectthermal: -942.592931 hartree
zpe.sumelectthermalent: -942.591987 hartree
zpe.sumelectthermalfe: -942.670073 hartree
dipole: 0.4750 -0.5879 -2.1947
dipole: 2.3212
quadrupole: -117.1145 -133.3601 -128.6114
quadrupole: -8.1489 0.1724 4.2570
quadrupole: 9.2475 -6.9981 -2.2494 -8.1489 0.1724 4.2570
hfenergy: -943.0126841 hartree
pointgroup: C01 [X(C19H25N1O2)]
dipole: 0.1894157 -0.1655058 -0.8778969 debye
polarizability: 291.7617623|-37.4671185|166.4940462|15.0653457|11.2916562|233.1854316 unknown
InChI: InChI=1S/C19H25NO2/c1-4-5-8-14-19(2,3)22-18(21)20-17-13-9-11-15-10-6-7-12-16(15)17/h6-7,9-13,20H,4-5,8,14H2,1-3H3
charge 0 multiplicity 1
47 atoms
O  1.525073 -1.491889 -0.56335
O  1.038554 -0.952079 1.696724
N  -0.522684 -0.721839 -0.074287
C  2.959707 -1.934421 -0.296127
C  3.780004 -0.760156 0.300996
C  3.78209 0.547119 -0.522085
C  4.515637 1.694702 0.208657
C  3.430666 -2.336585 -1.704601
C  2.940023 -3.150118 0.652464
C  4.546868 3.009317 -0.603964
C  5.274213 4.15521 0.13208
C  0.710271 -1.043699 0.486237
C  -1.681231 -0.223102 0.575344
C  -2.850411 0.048437 -0.24227
C  -4.041892 0.558999 0.409086
C  -1.716633 0.006897 1.960683
C  -2.893889 -0.159935 -1.662384
C  -4.043485 0.782483 1.82465
C  -2.900392 0.509111 2.575245
C  -5.207521 0.834016 -0.380875
C  -4.044986 0.117432 -2.405013
C  -5.216501 0.620198 -1.759553
H  4.822141 -1.123842 0.415068
H  3.399047 -0.552138 1.317048
H  2.737837 0.855028 -0.729301
H  4.263504 0.382583 -1.507129
H  5.556558 1.382818 0.438365
H  4.023725 1.880182 1.18593
H  3.319531 -1.50156 -2.415728
H  4.494501 -2.632831 -1.672752
H  2.839207 -3.19006 -2.078632
H  2.582751 -2.865359 1.654739
H  3.961955 -3.561639 0.744068
H  2.285212 -3.943325 0.249743
H  3.506753 3.317613 -0.834994
H  5.040009 2.822927 -1.580127
H  5.282386 5.083219 -0.468893
H  4.781374 4.381352 1.096479
H  6.324755 3.883267 0.34875
H  -0.566309 -0.878571 -1.081304
H  -0.828336 -0.203089 2.558845
H  -2.022521 -0.543449 -2.207105
H  -4.951356 1.168496 2.30163
H  -2.898005 0.678331 3.657494
H  -6.100252 1.219651 0.12587
H  -4.049741 -0.050944 -3.487328
H  -6.114108 0.834942 -2.34929
