program: Gaussian 09
title: 000298047
version: EM64L-G09RevD.01
frameworkgroup: C1[X(C19H25NO2)]
method: RPBEPBE
basis: SDD
operation: Freq
keyword: #p
keyword: freq=noraman
keyword: PBEPBE/SDD
title: #p freq=noraman PBEPBE/SDD
converged: YES YES NO NO
title: Mulliken charges:
elementType: O O N C C C C C C C C C C C C C C C C C C C H H H H H H H H H H H H H H H H H H H H H H H H H
charge: -0.341996 -0.268487 -0.471864 0.046073 -0.432149 -0.028764 -0.415640 -0.351032 -0.716465 -0.716649 -0.697573 0.238579 0.342547 0.154693 0.433709 -0.386913 -0.339084 -0.471394 -0.233132 -0.425433 -0.274019 -0.243708 0.238616 0.223786 0.202899 0.202917 0.199639 0.203987 0.220559 0.195072 0.222158 0.209968 0.214280 0.214019 0.211793 0.213805 0.210795 0.207461 0.219346 0.331062 0.300832 0.192931 0.238052 0.227132 0.239120 0.228450 0.230025
chargesum: 0.00000
title: Mulliken charges with hydrogens summed into heavy atoms:
elementType: O O N C C C C C C C C C C C C C C C C C C C
charge: -0.341996 -0.268487 -0.140803 0.284689 -0.005464 0.174154 -0.012014 0.064599 -0.070059 -0.077032 -0.059972 0.238579 0.342547 0.154693 0.433709 -0.086081 -0.146153 -0.233342 -0.006000 -0.186313 -0.045569 -0.013683
polarizability: 3.11185885e+02 -6.74875429e+00 2.10133953e+02 -1.08882138e+01 4.46660319e+01 1.73718919e+02
1716.lowfreq: -20.4071 -6.2711 0.0004 0.0006 0.0008 1.7618 9.4436 16.6856 23.6558
frequency: -9.6753 15.6106 22.4853 39.2152 55.6509 60.8910 70.6591 73.9878 90.4853 133.4031 145.6495 173.2474 177.6581 198.4701 212.5404 220.6255 230.4310 235.0648 268.8468 281.8074 302.5494 305.0824 370.4564 400.5181 417.7267 421.2264 452.1584 462.7440 471.4235 505.7229 511.3151 523.0355 558.1364 617.2857 627.1364 646.3803 687.5967 701.1506 720.9484 739.5616 758.3726 782.6082 782.9122 807.2993 813.5989 825.7436 844.4092 863.9834 869.3421 904.8387 911.2635 915.9458 923.1873 949.8380 951.3210 958.8838 959.6870 984.9336 991.9233 996.1515 1032.8517 1054.4267 1059.6626 1065.7646 1081.6451 1094.2317 1131.8695 1140.8188 1152.0627 1160.1852 1173.5717 1178.1335 1182.4555 1195.1782 1220.4253 1236.1318 1244.8072 1272.0365 1280.3414 1282.8377 1289.1829 1291.8125 1320.9924 1328.0246 1342.0833 1352.8449 1363.3799 1368.2285 1377.7171 1393.0112 1395.5848 1409.3061 1420.3131 1444.0917 1452.1470 1454.6701 1454.9710 1467.8339 1470.6189 1474.1022 1477.8664 1481.5545 1486.1457 1489.3094 1493.4744 1540.6048 1592.0682 1598.7640 1635.0238 1658.3131 2964.1858 2967.7736 2971.1141 2972.5385 2973.5259 2975.6105 2980.1384 3014.7889 3024.9834 3039.2742 3047.0132 3062.5955 3067.0584 3070.3049 3071.1054 3072.8184 3073.6767 3111.6174 3124.4824 3129.5151 3142.8566 3153.7523 3163.6247 3189.3544 3565.5437
redmass: 3.1637 4.3276 3.2164 3.8767 5.8328 2.4892 4.4961 1.9630 3.7619 4.0462 2.2766 3.5707 4.0612 1.6902 1.6920 1.8192 1.2370 1.5971 3.9158 5.2097 3.5393 3.1109 2.7440 2.1456 3.0291 4.1710 3.1180 3.0795 3.3740 3.6226 5.6493 5.1477 2.3829 5.7216 1.5919 3.3404 5.7205 6.1101 1.7932 1.2917 1.8674 5.1222 2.0882 1.4253 2.5379 2.3732 1.7184 3.5089 1.8725 1.7428 1.6507 1.3943 1.3558 1.7925 1.4098 1.9191 3.1679 1.3322 1.3583 2.4376 2.9112 1.6158 2.6228 1.9672 2.4190 2.3066 2.1947 2.4115 1.6334 1.9621 2.0999 1.8491 1.1310 1.2858 1.4625 1.8942 1.3047 1.6253 1.2413 1.2653 2.2090 1.1646 1.3012 1.4361 1.3423 1.4538 1.7019 2.1852 1.2134 1.2181 1.2114 2.8299 5.5845 2.5350 1.0813 1.9998 1.1669 1.0492 1.0542 1.0566 1.0421 1.0567 1.0778 1.0714 2.4445 2.8240 7.3826 5.2948 6.3382 7.2767 1.0804 1.0366 1.0449 1.0463 1.0512 1.0502 1.0619 1.0911 1.0941 1.1007 1.0991 1.0998 1.0999 1.0999 1.0998 1.0992 1.0990 1.0864 1.0877 1.0868 1.0938 1.0966 1.1003 1.0944 1.0749
irintensity: 0.0043 0.1952 0.0506 0.5262 2.6858 0.1093 1.8632 0.1379 0.4246 0.0389 0.2191 1.4120 2.7211 2.0059 2.0690 1.2189 0.1262 2.7169 2.4570 6.6406 4.3616 4.4535 0.5442 0.2281 9.1778 2.6160 15.6253 1.3117 0.1114 2.5787 0.7834 0.3651 0.0374 6.2026 31.7774 5.6239 8.2605 36.0731 1.9253 24.3115 7.4100 5.1828 67.4700 72.6132 2.3738 5.6450 17.8237 11.5760 17.6916 12.1798 12.2257 12.6203 2.8624 17.9539 1.5535 14.7541 149.6142 0.9899 4.2819 55.0764 48.7255 15.8474 110.1422 45.6324 1.7987 25.6731 37.4395 123.8021 114.5190 205.8106 43.8633 6.8190 11.7517 2.6459 1.0825 4.0086 3.2083 23.0673 6.3123 4.9405 16.6188 1.6699 2.3498 2.7582 7.9255 47.3035 9.3411 40.7208 15.5218 10.6815 16.1411 35.3255 98.3773 2.9617 4.1532 1.0304 1.1278 2.6868 8.0371 2.8344 11.6918 7.8104 10.0116 80.0962 368.1811 429.2236 51.7756 11.1214 11.6080 209.8095 19.3085 32.1442 19.1987 42.2759 22.0711 10.6609 59.3589 3.2292 5.8896 11.9897 25.1647 22.8773 16.0641 110.2499 37.7470 104.7632 52.1590 18.1609 0.9036 2.0701 32.0901 33.4831 28.8459 4.5812 26.6002
temp: 298.150 k
press: 1.00000 atm
elementType: 8 8 7 6 6 6 6 6 6 6 6 6 6 6 6 6 6 6 6 6 6 6 1 1 1 1 1 1 1 1 1 1 1 1 1 1 1 1 1 1 1 1 1 1 1 1 1
symmnumber: 1
zpe: 1043370.1 jmol-1
zpe.correction: 0.397399 hartree
zpe.thermalcorrener: 0.419228 hartree
zpe.thermalcorrenthalpy: 0.420173 hartree
zpe.thermalcorrgfe: 0.344353 hartree
zpe.sumelectzpe: -942.614144 hartree
zpe.sumelectthermal: -942.592314 hartree
zpe.sumelectthermalent: -942.591370 hartree
zpe.sumelectthermalfe: -942.667189 hartree
dipole: 0.5072 1.7026 1.4994
dipole: 2.3246
quadrupole: -113.7288 -131.2103 -134.2154
quadrupole: 0.7149 -0.2853 4.5215
quadrupole: 12.6561 -4.8255 -7.8306 0.7149 -0.2853 4.5215
hfenergy: -943.0115424 hartree
pointgroup: C01 [X(C19H25N1O2)]
dipole: -0.2162864 0.6602326 -0.5947931 debye
polarizability: 309.9326766|17.0808017|212.9511899|0.7429597|-43.9380904|172.1548913 unknown
InChI: InChI=1S/C19H25NO2/c1-4-8-16(13-14(2)3)22-19(21)20-18-12-7-10-15-9-5-6-11-17(15)18/h5-7,9-12,14,16,20H,4,8,13H2,1-3H3
charge 0 multiplicity 1
47 atoms
O  -1.645463 0.470361 -0.276257
O  -0.944765 -1.352401 1.050937
N  0.56521 0.17379 0.030106
C  -3.080406 0.030938 -0.139941
C  -3.365108 -0.981222 -1.26761
C  -4.788891 -1.604489 -1.261293
C  -3.914486 1.317689 -0.195507
C  -3.653506 2.282794 0.982743
C  -5.106415 -2.329079 0.06998
C  -4.9273 -2.580108 -2.454792
C  -4.525162 3.55425 0.908572
C  -0.68345 -0.346591 0.343563
C  1.840078 -0.299838 0.435382
C  3.011131 0.395748 -0.067001
C  4.319813 -0.073858 0.346476
C  1.98352 -1.402218 1.293638
C  2.947078 1.523241 -0.953774
C  4.430693 -1.200436 1.225222
C  3.281408 -1.844968 1.68195
C  5.489962 0.601044 -0.136882
C  4.10546 2.159352 -1.40854
C  5.392704 1.695869 -0.996144
H  -3.168734 -0.45931 0.847822
H  -2.626429 -1.803162 -1.185483
H  -3.190732 -0.478567 -2.240292
H  -5.532508 -0.792332 -1.402119
H  -4.985021 1.030868 -0.201224
H  -3.718081 1.833221 -1.157272
H  -2.582521 2.559927 0.991152
H  -3.848769 1.753133 1.93757
H  -4.338745 -3.095524 0.288594
H  -6.08792 -2.835397 0.013975
H  -5.139109 -1.633588 0.928683
H  -5.947715 -3.002984 -2.50695
H  -4.216679 -3.422668 -2.352392
H  -4.717506 -2.074968 -3.416331
H  -4.327987 4.117253 -0.02338
H  -5.602516 3.301804 0.925619
H  -4.323366 4.230154 1.759463
H  0.526684 0.997405 -0.570667
H  1.091697 -1.915294 1.658045
H  1.985008 1.9158 -1.305016
H  5.426399 -1.543279 1.528063
H  3.362255 -2.707348 2.352451
H  6.472117 0.234748 0.185083
H  4.027147 3.016805 -2.085598
H  6.295028 2.200734 -1.357323
