program: Gaussian 09
title: 000298018
version: EM64L-G09RevD.01
frameworkgroup: C1[X(C13H13O4P)]
method: RPBEPBE
basis: SDD
operation: Freq
keyword: #p
keyword: freq=noraman
keyword: PBEPBE/SDD
title: #p freq=noraman PBEPBE/SDD
converged: YES YES NO NO
title: Mulliken charges:
elementType: P O O O O C C C C C C C C C C C C C H H H H H H H H H H H H H
charge: 1.201953 -0.515460 -0.500094 -0.180532 -0.629969 0.205679 0.341493 0.405162 -0.257255 -0.377841 -0.358825 -0.421310 -0.422508 -0.282915 -0.240409 -0.239833 -0.480671 -0.478885 0.297664 0.298888 0.246675 0.242945 0.243970 0.234797 0.235590 0.226656 0.238275 0.251538 0.234431 0.230528 0.250260
chargesum: 0.00000
title: Mulliken charges with hydrogens summed into heavy atoms:
elementType: P O O O O C C C C C C C C C C C C C
charge: 1.201953 -0.515460 -0.500094 -0.180532 -0.629969 0.205679 0.341493 0.405162 -0.257255 -0.080177 -0.059937 -0.174635 -0.179562 -0.038945 -0.005612 -0.004243 0.235799 0.236334
polarizability: 2.69564481e+02 3.89872903e+00 2.02241099e+02 -7.26234262e+00 -8.44653872e+00 9.93664144e+01
1716.lowfreq: -2.7039 -0.0008 0.0010 0.0015 1.9824 6.2572 19.6577 28.3779 61.7462
frequency: 19.3071 28.2836 61.7396 80.2305 85.3805 93.7502 113.9449 117.0392 139.8204 180.0988 181.7302 183.8655 198.1762 209.7245 222.6461 309.4894 322.7416 368.9258 378.2525 394.6438 454.2871 470.4498 481.7750 494.5446 505.8055 556.6450 584.4544 607.5744 641.5366 659.5445 687.2237 738.9366 757.9822 787.2557 788.6314 833.6022 884.7914 898.6309 957.5090 960.9694 965.7172 981.9706 1009.2205 1010.0898 1014.2431 1031.5331 1062.8456 1095.9987 1110.3144 1111.6556 1128.9810 1132.5199 1152.1209 1180.6887 1195.1417 1240.9031 1260.9162 1284.2007 1377.4687 1404.4959 1413.4651 1423.8146 1425.3819 1439.8192 1455.5705 1459.1649 1460.4200 1472.3435 1475.9328 1516.5617 1575.1836 1585.1487 1600.1725 1626.3038 2980.4157 2990.6621 3081.2170 3099.7843 3103.1174 3118.3873 3121.0031 3126.2284 3129.7411 3140.9224 3162.6953 3165.5225 3194.5449
redmass: 5.1823 5.2596 2.8981 1.0630 2.5649 4.7934 4.3137 3.1110 1.5716 7.5919 4.7238 6.4736 4.4912 4.9064 4.4646 9.8384 9.3274 5.7463 6.4442 3.5550 6.2695 3.2460 8.8313 3.6680 7.3434 7.6737 8.6638 4.6300 5.9325 7.2037 4.6077 6.4971 1.4301 5.4971 1.9266 1.5400 5.7539 1.6281 10.0209 1.3813 10.0694 1.4037 1.3939 1.3503 15.7929 2.7978 3.8711 2.3336 1.2311 1.2309 1.2931 1.3046 1.4167 1.1107 1.4256 1.8620 1.8987 2.0172 2.3843 3.6058 3.8847 1.1186 1.1319 2.2254 1.0534 2.1605 1.0546 1.0538 1.0549 3.7139 7.3640 4.8093 8.0702 6.3625 1.0294 1.0282 1.1052 1.1041 1.0950 1.1060 1.1035 1.0877 1.0890 1.0909 1.0984 1.0973 1.0946
irintensity: 3.0842 0.1688 2.3242 0.1547 3.7902 1.3547 1.2063 1.0723 2.4098 5.6026 5.8017 9.1532 11.4035 7.0297 19.3988 14.8975 24.6644 2.7485 8.7005 1.5383 34.0541 0.7025 25.4235 20.0403 2.0578 12.8373 198.4031 29.2939 79.8832 4.5532 38.0350 4.7319 1.1585 1.0859 67.1545 76.7653 27.7948 3.3682 206.0487 8.7267 188.3851 1.9806 3.4737 0.2367 99.9540 0.7511 58.2469 2.9838 0.1446 5.0331 1.0307 0.4822 12.6982 2.9099 16.9349 12.5268 117.2792 20.3269 2.3753 17.9263 4.0688 2.9170 8.7526 4.3019 8.5384 6.3235 14.7591 21.1798 5.8771 88.8270 152.7010 19.0163 54.3490 21.0078 66.3575 55.4654 25.4128 22.6710 37.1612 23.8446 16.9096 0.3224 4.4632 16.5339 29.0877 21.3568 8.9818
temp: 298.150 k
press: 1.00000 atm
elementType: 15 8 8 8 8 6 6 6 6 6 6 6 6 6 6 6 6 6 1 1 1 1 1 1 1 1 1 1 1 1 1
symmnumber: 1
zpe: 607323.1 jmol-1
zpe.correction: 0.231317 hartree
zpe.thermalcorrener: 0.249548 hartree
zpe.thermalcorrenthalpy: 0.250492 hartree
zpe.thermalcorrgfe: 0.183250 hartree
zpe.sumelectzpe: -1143.976039 hartree
zpe.sumelectthermal: -1143.957808 hartree
zpe.sumelectthermalent: -1143.956864 hartree
zpe.sumelectthermalfe: -1144.024106 hartree
dipole: -3.4562 -0.6132 2.1874
dipole: 4.1359
quadrupole: -90.4306 -104.6792 -117.1553
quadrupole: -9.6773 8.8932 3.4733
quadrupole: 13.6577 -0.5909 -13.0669 -9.6773 8.8932 3.4733
hfenergy: -1144.2073559 hartree
pointgroup: C01 [X(C13H13O4P1)]
dipole: -1.2132466 -1.0794106 0.1033636 debye
polarizability: 263.57836|24.2882304|142.3548541|2.7979579|52.3494177|165.2387803 unknown
InChI: InChI=1S/C13H13O4P/c1-16-18(15,17-2)13(14)12-9-5-7-10-6-3-4-8-11(10)12/h3-9H,1-2H3
charge 0 multiplicity 1
31 atoms
P  2.566214 0.960663 0.422289
O  3.206572 -0.540585 1.061934
O  3.624425 1.401863 -0.878964
O  1.290556 -0.508515 -1.485772
O  2.488853 2.146342 1.491535
C  -1.53565 -0.295375 -0.439362
C  -0.358175 0.387351 0.092244
C  -2.81974 -0.011075 0.176265
C  0.983688 0.166528 -0.472562
C  -0.495639 1.29903 1.165427
C  -1.504038 -1.234837 -1.52162
C  -2.903534 0.922879 1.259883
C  -4.002668 -0.663649 -0.303069
C  -1.764157 1.568209 1.744731
C  -2.677711 -1.856653 -1.965873
C  -3.937832 -1.574169 -1.358471
C  4.180033 -0.454753 2.177026
C  4.261314 0.392532 -1.758849
H  0.385515 1.821365 1.559054
H  -0.551896 -1.460205 -2.003901
H  -3.885732 1.124248 1.704568
H  -4.960897 -0.433312 0.17741
H  -1.837094 2.283412 2.569556
H  -2.626641 -2.571182 -2.794805
H  -4.844193 -2.070306 -1.721031
H  5.203248 -0.323165 1.781699
H  4.098637 -1.415264 2.708074
H  3.928807 0.382959 2.852808
H  4.513065 -0.523611 -1.19547
H  5.17639 0.878126 -2.133397
H  3.581583 0.141048 -2.589056
