program: Gaussian 09
title: 000298014
version: EM64L-G09RevD.01
frameworkgroup: C1[X(C10H13O5P)]
method: RPBEPBE
basis: SDD
operation: Freq
keyword: #p
keyword: freq=noraman
keyword: PBEPBE/SDD
title: #p freq=noraman PBEPBE/SDD
converged: YES YES NO NO
title: Mulliken charges:
elementType: P O O O O O C C C C C C C C C C H H H H H H H H H H H H H
charge: 1.189329 -0.517699 -0.503107 -0.224091 -0.634323 -0.126264 0.317378 -0.231164 0.228204 -0.314769 -0.359126 -0.279761 -0.209877 -0.481588 -0.481957 -0.537284 0.299540 0.249564 0.242547 0.234469 0.250601 0.225419 0.236197 0.233007 0.228689 0.252529 0.226847 0.259323 0.227367
chargesum: 0.00000
title: Mulliken charges with hydrogens summed into heavy atoms:
elementType: P O O O O O C C C C C C C C C C
charge: 1.189329 -0.517699 -0.503107 -0.224091 -0.634323 -0.126264 0.317378 -0.231164 0.228204 -0.015229 -0.109562 -0.037214 0.024592 0.230629 0.232268 0.176254
polarizability: 2.06812723e+02 -8.32065773e+00 1.71600755e+02 4.01254638e+00 4.78774465e+00 9.43901078e+01
1716.lowfreq: -6.7628 -3.3169 0.0008 0.0011 0.0015 5.0259 17.1879 27.4739 58.7360
frequency: 15.9908 27.2003 58.6967 83.1586 84.9131 103.0096 110.2704 112.5564 118.0603 131.8872 170.5252 181.6604 198.4091 209.2051 223.5262 256.0118 271.3964 311.3791 320.0667 376.9513 392.7887 431.4394 473.2135 508.2787 516.7660 555.6423 585.0523 614.6656 657.4811 660.8059 749.5800 757.1239 771.6504 860.4921 866.9491 957.9910 966.6845 971.1785 972.3854 1001.1080 1012.4004 1052.7385 1108.6867 1110.2702 1111.5631 1128.4223 1130.9884 1131.9370 1151.0353 1188.1205 1209.0733 1244.1180 1308.0072 1379.7433 1421.3850 1423.3418 1424.4892 1444.3469 1454.5325 1460.2935 1464.4826 1472.4454 1473.9614 1477.3266 1486.3320 1568.2308 1607.2437 1622.5262 2971.4632 2978.5808 2989.3714 3065.9275 3078.4264 3098.0206 3105.8399 3117.5514 3118.6858 3138.7473 3140.1238 3166.1886 3176.6480
redmass: 5.4990 4.8130 2.7725 1.4382 1.4176 4.6958 3.9182 3.0231 2.6191 2.1257 6.5616 6.8951 4.3544 4.4878 1.7188 3.8312 2.0779 7.3821 8.5840 6.8765 7.4824 3.8512 8.9848 4.8822 3.7126 7.1112 8.4261 7.4821 6.9503 7.5783 5.6451 4.2055 1.3039 5.7463 1.5356 10.9398 10.3303 7.6217 1.3879 1.3420 15.1827 2.3934 1.2581 1.2318 1.2308 1.3006 1.7805 1.3818 1.4546 1.0923 3.0772 3.5193 1.5127 10.6863 1.5358 1.1237 1.1239 1.4970 1.0534 1.0524 1.1560 1.0505 1.0533 1.0549 1.8446 6.2456 5.5492 11.8463 1.0325 1.0294 1.0284 1.1046 1.1051 1.1036 1.0948 1.1060 1.1034 1.0928 1.0952 1.0928 1.0981
irintensity: 3.3304 1.0452 2.7049 2.0511 2.1645 0.1495 3.3524 2.5940 0.6244 3.6210 12.0617 3.2462 7.2051 27.4029 2.6054 14.3244 0.7360 0.4650 30.8464 3.9274 19.1123 0.4988 31.7936 2.3060 10.0552 24.8716 183.0814 81.2471 13.8359 47.2747 10.2872 1.5746 112.0920 63.3720 4.3544 193.4650 176.1004 29.0006 5.6453 0.7364 116.4043 1.8818 0.1563 0.2199 6.5189 0.9969 17.1227 2.4900 13.3657 16.7001 112.5142 186.2284 30.5763 2.2362 40.2128 3.3384 9.6598 14.6957 8.3264 14.6361 89.7933 14.2168 21.1177 5.0558 54.4603 104.4889 50.0380 193.7163 63.9828 62.7859 57.7423 37.4456 26.7987 23.5924 34.7101 19.6427 20.0764 13.6763 3.1778 11.7013 21.1917
temp: 298.150 k
press: 1.00000 atm
elementType: 15 8 8 8 8 8 6 6 6 6 6 6 6 6 6 6 1 1 1 1 1 1 1 1 1 1 1 1 1
symmnumber: 1
zpe: 567327.6 jmol-1
zpe.correction: 0.216084 hartree
zpe.thermalcorrener: 0.234494 hartree
zpe.thermalcorrenthalpy: 0.235438 hartree
zpe.thermalcorrgfe: 0.167565 hartree
zpe.sumelectzpe: -1104.938001 hartree
zpe.sumelectthermal: -1104.919591 hartree
zpe.sumelectthermalent: -1104.918647 hartree
zpe.sumelectthermalfe: -1104.986520 hartree
dipole: 5.0554 1.2266 2.7350
dipole: 5.8772
quadrupole: -72.6592 -97.0503 -104.7997
quadrupole: -3.6699 -6.6223 -3.5191
quadrupole: 18.8439 -5.5473 -13.2966 -3.6699 -6.6223 -3.5191
hfenergy: -1105.154085 hartree
pointgroup: C01 [X(C10H13O5P1)]
dipole: -1.8281303 0.4881186 -1.3290069 debye
polarizability: 207.5782366|5.497868|164.4051515|9.4831822|-20.2672361|100.8201977 unknown
InChI: InChI=1S/C8H7O2.C2H6O3P/c1-10-8-5-3-2-4-7(8)6-9;1-4-6(3)5-2/h2-5H,1H3;1-2H3
charge 0 multiplicity 1
29 atoms
P  2.071276 -0.527552 0.285884
O  2.654702 -0.667887 -1.363954
O  3.170002 0.562316 1.072082
O  -1.854645 1.907743 -1.083706
O  2.019122 -1.916249 1.077007
O  0.747047 1.779616 -0.38022
C  -0.848519 -0.064695 -0.120973
C  0.469293 0.588686 -0.126559
C  -2.025674 0.62155 -0.598839
C  -0.991745 -1.393792 0.378974
C  -3.282843 -0.033264 -0.568812
C  -2.244887 -2.029671 0.411074
C  -3.387095 -1.345758 -0.065513
C  3.61334 -1.756509 -1.666557
C  3.78218 1.712725 0.36517
C  -3.026541 2.6248 -1.607192
H  -0.107458 -1.922822 0.756186
H  -4.179492 0.475272 -0.932962
H  -2.331635 -3.046319 0.805151
H  -4.367518 -1.834822 -0.046319
H  3.370422 -2.665571 -1.086593
H  4.645455 -1.433531 -1.439483
H  3.504672 -1.948156 -2.7450
H  3.996394 1.463193 -0.689565
H  4.718301 1.916417 0.909111
H  3.10423 2.580384 0.40968
H  -3.470024 2.090305 -2.468462
H  -2.630633 3.596806 -1.932421
H  -3.788125 2.772984 -0.818589
