program: Gaussian 09
title: 000298000
version: EM64L-G09RevD.01
frameworkgroup: C1[X(C12H14O3)]
method: RPBEPBE
basis: SDD
operation: Freq
keyword: #pfreq=noraman
keyword: PBEPBE/SDD
title: #p freq=noraman PBEPBE/SDD
converged: YES YES NO NO
title: Mulliken charges:
elementType: O O O C C C C C C C C C C C C H H H H H H H H H H H H H H
charge: -0.415748 -0.230230 -0.209902 -0.373873 -0.571763 -0.356749 0.514996 -0.490231 -0.405021 -0.395616 -0.373842 -0.362048 0.376883 0.174798 -0.204158 0.210166 0.211810 0.214635 0.215143 0.218395 0.220251 0.255150 0.254102 0.239032 0.239417 0.232807 0.270265 0.163907 0.377422
chargesum: 0.00000
title: Mulliken charges with hydrogens summed into heavy atoms:
elementType: O O O C C C C C C C C C C C C
charge: -0.038326 -0.230230 -0.209902 0.048103 -0.141985 0.081897 0.514996 0.019022 -0.165989 -0.156199 -0.141035 -0.091783 0.376883 0.174798 -0.040251
polarizability: 2.09846211e+02 1.82070678e+01 1.10859261e+02 1.42723227e+01 -1.16795485e+01 1.04709016e+02
1716.lowfreq: -4.4409 0.0006 0.0009 0.0010 2.2226 15.5177 18.5032 19.7148 34.1776
frequency: 17.8855 19.5926 34.1680 50.3687 89.1904 90.4318 122.1062 126.7337 182.6697 193.6291 249.7912 291.3659 339.8718 375.0054 409.3211 421.4226 477.1452 501.1421 532.2284 586.0438 618.2148 635.8760 638.7980 733.1489 734.8162 777.3868 788.6199 830.8656 846.5009 858.2429 864.3684 899.6357 961.6009 990.3645 1003.9644 1009.0038 1014.9426 1024.5273 1058.7599 1071.0405 1089.4101 1114.2420 1134.3192 1178.9308 1219.4667 1220.7206 1226.3804 1232.9628 1259.3285 1282.9402 1287.4101 1307.0604 1311.4156 1341.8781 1369.1424 1372.2319 1403.3740 1415.3179 1437.0897 1465.8096 1473.0562 1487.6191 1499.6976 1568.5856 1608.5125 1625.3080 1668.7662 2864.5180 2969.0160 2983.3860 2987.3880 2996.4187 3012.9784 3031.5454 3045.8195 3065.2076 3113.6441 3123.9401 3137.7434 3154.2673 3513.6740
redmass: 8.6059 4.7485 6.5488 2.5905 2.5611 4.3170 2.1038 6.8593 4.2032 4.2450 4.7600 3.8499 2.6777 3.8251 3.0884 4.2409 4.0579 1.8022 2.9441 4.7672 5.4504 6.2581 1.3200 1.1137 3.5688 3.2633 1.3165 2.7790 2.2240 2.9323 1.4619 1.4267 1.4364 1.4974 1.6049 3.0403 3.5630 3.2375 1.5398 2.6436 2.5921 1.4175 1.1965 1.1809 2.7837 2.2463 1.3779 1.3478 1.5466 1.1767 1.0646 1.3224 1.5517 1.5330 1.7757 1.8694 2.8367 2.5840 1.0847 1.0748 1.1003 1.1031 2.6355 7.5520 6.1062 6.8896 8.2661 1.0846 1.0590 1.0595 1.0613 1.0593 1.0996 1.0995 1.1036 1.1036 1.0871 1.0888 1.0965 1.0960 1.0640
irintensity: 1.8893 1.3311 0.7694 0.1346 0.2496 0.9881 0.1319 5.0110 5.8389 8.9517 2.5611 3.3875 3.1561 1.4930 0.5581 9.1589 14.5810 28.4305 29.9192 23.3467 10.1568 3.5623 129.4531 13.3010 4.9450 23.2195 2.2394 31.7191 18.8449 2.5508 10.1564 1.6710 1.0673 1.8399 4.6194 17.1653 75.8312 148.2904 3.2020 50.0719 34.4736 3.5176 7.1416 37.5451 6.0956 70.6903 16.2244 0.0345 23.3548 0.3186 0.8230 11.3186 10.9302 26.7476 2.0244 38.0642 8.2610 21.3883 29.7668 0.0526 3.3681 17.3593 2.1603 94.7091 264.7754 30.4148 213.7693 134.9853 6.1182 26.6617 9.4214 47.2261 1.1363 0.5074 6.3468 69.8288 9.4273 13.1451 19.6963 5.1282 20.6462
temp: 298.150 k
press: 1.00000 atm
elementType: 8 8 8 6 6 6 6 6 6 6 6 6 6 6 6 1 1 1 1 1 1 1 1 1 1 1 1 1 1
symmnumber: 1
zpe: 610522.0 jmol-1
zpe.correction: 0.232536 hartree
zpe.thermalcorrener: 0.247649 hartree
zpe.thermalcorrenthalpy: 0.248593 hartree
zpe.thermalcorrgfe: 0.186374 hartree
zpe.sumelectzpe: -690.243133 hartree
zpe.sumelectthermal: -690.228019 hartree
zpe.sumelectthermalent: -690.227075 hartree
zpe.sumelectthermalfe: -690.289294 hartree
dipole: 3.3757 1.1705 -1.3934
dipole: 3.8350
quadrupole: -115.6611 -90.2866 -86.7234
quadrupole: -17.7415 -0.6508 -6.9102
quadrupole: -18.1040 7.2704 10.8337 -17.7415 -0.6508 -6.9102
hfenergy: -690.4756681 hartree
pointgroup: C01 [X(C12H14O3)]
dipole: 1.3280911 -0.5312462 0.47999 debye
polarizability: 209.7940596|-16.1982502|113.8934678|-16.6940817|-10.406907|101.7269597 unknown
InChI: InChI=1S/C12H14O3/c13-9-11-7-5-10(6-8-11)3-1-2-4-12(14)15/h5-9,14H,1-4H2
charge 0 multiplicity 1
29 atoms
O  6.126152 0.960782 1.064384
O  5.719112 -0.497346 -0.69598
O  -5.874453 1.213136 0.29559
C  1.369915 -0.014778 0.035631
C  0.376694 -0.754809 -0.905898
C  2.840971 -0.258076 -0.363537
C  -1.07267 -0.513214 -0.520589
C  3.820345 0.477923 0.569832
C  -1.737961 -1.379215 0.387396
C  -1.779961 0.612867 -1.029411
C  -3.068405 -1.128671 0.77822
C  -3.10723 0.869544 -0.644398
C  -3.764525 -0.001878 0.266802
C  5.27455 0.235729 0.213809
C  -5.164652 0.246308 0.685516
H  1.19925 -0.351488 1.078161
H  1.145518 1.070885 0.016941
H  0.603908 -1.838188 -0.877761
H  0.555996 -0.413617 -1.944166
H  3.008279 0.07214 -1.406815
H  3.062808 -1.342373 -0.348219
H  3.644086 1.571219 0.555966
H  3.675648 0.168415 1.623945
H  -1.207201 -2.254644 0.780582
H  -1.277293 1.282661 -1.737977
H  -3.57645 -1.80551 1.477345
H  -3.66194 1.730737 -1.033291
H  -5.57712 -0.509313 1.403177
H  7.072327 0.780375 0.811245
