program: Gaussian 09
title: 000297998
version: EM64L-G09RevD.01
frameworkgroup: C1[X(C8H11NO3S)]
method: RPBEPBE
basis: SDD
operation: Freq
keyword: #p
keyword: freq=noraman
keyword: PBEPBE/SDD
title: #p freq=noraman PBEPBE/SDD
converged: YES YES NO NO
title: Mulliken charges:
elementType: S O O O N C C C C C C C C H H H H H H H H H H H
charge: 0.894148 -0.196584 -0.554407 -0.538927 -0.096679 -0.068006 -0.256385 -0.234031 -0.601622 -0.203271 -0.204644 -0.217967 -0.498434 0.287909 0.270874 0.251120 0.271429 0.239500 0.240879 0.240130 0.237282 0.228851 0.274841 0.233994
chargesum: 0.00000
title: Mulliken charges with hydrogens summed into heavy atoms:
elementType: S O O O N C C C C C C C C
charge: 0.894148 -0.196584 -0.554407 -0.538927 -0.096679 -0.068006 0.031524 0.036844 0.160425 0.037608 0.035485 0.019315 0.239253
polarizability: 1.84592637e+02 -6.19877720e+00 1.36499278e+02 1.67597382e+00 3.64593963e+00 9.75685483e+01
1716.lowfreq: -8.0842 -4.3295 -0.0026 -0.0020 -0.0016 6.6233 15.4288 29.5499 47.7119
frequency: 15.0150 29.4141 47.7079 101.8395 124.5067 137.4917 149.8827 161.0984 163.6200 178.3535 235.6840 244.1821 311.0238 339.4428 351.2279 398.6228 403.1384 447.3957 500.1874 507.1418 602.8517 655.1817 690.7417 757.4173 778.5906 802.6933 849.1906 901.4148 931.3649 948.9486 978.0720 982.3044 998.0928 1004.5686 1008.0488 1045.6989 1073.2161 1075.0252 1109.5218 1113.8402 1172.5543 1174.6192 1176.2641 1299.4892 1383.7386 1401.7372 1406.8019 1434.3666 1434.7240 1440.6505 1448.5045 1450.8442 1478.1228 1577.8653 1601.5072 2982.0042 2998.9255 3081.5348 3117.0797 3118.6027 3135.6324 3137.0934 3145.1488 3153.9912 3162.9220 3173.3010
redmass: 3.5408 3.9366 4.9631 1.1002 3.5726 2.0826 7.8527 2.8122 5.6053 2.3645 4.5171 5.4346 3.3194 7.7148 7.3213 5.4565 2.8231 7.5651 3.9067 4.3135 6.4780 6.9885 2.3768 1.4436 7.8466 4.7823 1.2482 16.8608 1.3644 8.8831 5.9917 1.4022 7.4287 1.3422 4.2021 2.1105 1.3903 1.5332 1.2770 1.3752 1.0629 1.5195 1.1903 1.3094 8.6727 1.1406 1.1348 1.0764 2.0984 1.0516 1.0455 2.0311 1.0516 5.8739 6.8803 1.0327 1.0280 1.1006 1.1009 1.1061 1.0856 1.1049 1.0882 1.0925 1.0968 1.1017
irintensity: 0.4121 0.3979 0.8789 0.5688 1.6309 5.4803 8.7013 1.9452 5.2995 5.8541 7.4319 9.2802 3.5928 1.0310 13.8590 5.2575 0.0509 85.8492 25.0878 32.6498 0.0176 4.4985 28.5039 77.8364 92.4024 46.0347 0.9459 56.7063 2.2792 88.9228 4.3226 0.0941 76.2980 0.3020 1.0206 22.1908 23.0327 6.2814 1.3770 17.4643 0.8179 24.6982 0.6518 3.3612 3.9547 21.7062 2.0247 9.1849 14.9476 23.1630 13.9653 15.0458 19.8987 3.8970 0.5823 12.5396 53.0611 4.2568 8.0406 15.9149 0.9906 9.6326 8.5286 0.7569 7.5430 31.3093
temp: 298.150 k
press: 1.00000 atm
elementType: 16 8 8 8 7 6 6 6 6 6 6 6 6 1 1 1 1 1 1 1 1 1 1 1
symmnumber: 1
zpe: 467989.8 jmol-1
zpe.correction: 0.178248 hartree
zpe.thermalcorrener: 0.193073 hartree
zpe.thermalcorrenthalpy: 0.194017 hartree
zpe.thermalcorrgfe: 0.134278 hartree
zpe.sumelectzpe: -988.714934 hartree
zpe.sumelectthermal: -988.700109 hartree
zpe.sumelectthermalent: -988.699165 hartree
zpe.sumelectthermalfe: -988.758904 hartree
dipole: 2.1236 2.1502 -4.7759
dipole: 5.6518
quadrupole: -69.5766 -77.6691 -93.0962
quadrupole: -2.8652 3.3019 4.6542
quadrupole: 10.5374 2.4448 -12.9822 -2.8652 3.3019 4.6542
hfenergy: -988.8931815 hartree
pointgroup: C01 [X(C8H11N1O3S1)]
dipole: -0.9231141 1.9587337 0.5054927 debye
dipolederiv: 1.3962038 -0.1314511 0.0765517 -0.1709773 1.0372547 0.0026395 0.1292652 0.0989802 1.0028241 -1.2718355 -0.6091718 0.0051459 -0.055665 -0.22239 0.0991022 0.4103519 0.3494144 -0.3553376 -0.6393744 0.03605 0.0262975 -0.020008 -0.4909209 -0.0177481 -0.1108022 -0.179387 -0.7433497 -0.6876656 -0.0730914 -0.0561055 -0.1601456 -0.7836275 0.0199904 -0.0031157 0.1179138 -0.4769021 1.0357043 0.7056964 0.1872922 0.304182 -0.1340524 0.0060298 -0.0711617 -0.1157065 0.0548057 0.0232611 -0.0103334 0.0283078 -0.145006 -0.1650208 -0.0846237 -0.0501395 -0.0664064 -0.1204202 -0.2298594 -0.0697496 0.0403218 0.1747909 -0.059961 -0.0452716 -0.1958857 0.0083722 -0.0988131 -0.2592759 0.070531 -0.1491894 -0.0599339 -0.079728 0.0194484 0.0998857 -0.0505203 -0.0343844 -0.024897 -0.042088 -0.1316136 -0.1378249 0.0284645 -0.0153002 0.0452796 0.1255581 -0.0366707 0.0231058 0.0666245 -0.1489656 0.0075382 -0.0886623 -0.0539224 -0.0439932 -0.0693386 -0.0037041 -0.0711411 -0.071481 0.0680703 0.0158605 -0.0150738 -0.1280585 -0.012223 -0.1146362 0.0151531 0.1026449 -0.0843675 -0.0095659 -0.0690709 -0.0651087 -0.0562558 -0.0091325 -0.0610182 -0.0629425 0.2792626 0.0295944 -0.0201595 0.2570259 0.4189868 -0.072289 -0.3441795 -0.2648283 0.2537834 0.1689204 0.0482084 -0.0261835 -0.0044732 0.0900728 0.0629774 -0.0163338 0.0432791 0.0834548 0.0805583 -0.0285599 0.0865763 -0.0353813 0.1232208 0.0076349 0.0491355 0.034451 0.0880144 0.0680734 -0.0698571 -0.0659663 -0.0599706 0.0486063 -0.0514163 -0.0844679 -0.0691167 -0.0058237 0.0759516 0.0510474 0.0112138 0.1185486 0.007378 0.0693283 0.0169762 -0.0371193 0.0639437 -0.0545953 0.0008265 0.0769401 0.0004149 0.0899176 0.0486673 0.0255782 -0.0081158 0.0714669 -0.050105 -0.0186854 0.0809704 -0.0091651 0.1102996 0.0704946 0.0982474 0.0680953 0.0424572 0.0362016 0.0428666 -0.0258044 0.0684798 0.0529625 0.1233096 -0.0299094 0.116998 0.0141767 -0.0933558 0.0772292 -0.0114978 0.0789168 0.1066039 0.0339022 -0.0133772 0.0336713 0.1162172 0.0920374 0.1190467 0.0158362 -0.0217433 -0.1371555 0.0074215 0.0599908 -0.0309857 0.0390799 0.1193303 0.0042558 -0.1147761 -0.0489867 0.0375975 -0.0824838 0.0078707 0.0234706 0.0032668 -0.1191508 -0.0431408 0.0563035 -0.0274058 0.0903356 0.0364234 0.0421402 0.046975 0.0897044 unknown
polarizability: 184.3205264|8.3110396|111.3526695|4.8925601|-18.0250782|122.9872675 unknown
InChI: InChI=1S/C6H5O2S.C2H6NO/c7-9(8)6-4-2-1-3-5-6;1-3-4-2/h1-5H;1-2H3
charge 0 multiplicity 1
24 atoms
S  0.849281 -0.827211 0.033806
O  3.25465 0.792515 0.569888
O  1.509911 -0.869065 -1.467828
O  0.731561 -2.19166 0.945936
N  1.922049 0.7889 1.107572
C  -0.903678 -0.133136 -0.122379
C  -1.866972 -0.570533 0.801898
C  -1.174325 0.770802 -1.16305
C  2.062143 0.186355 2.468865
C  -3.179355 -0.057918 0.676314
C  -2.492152 1.271919 -1.272806
C  -3.487219 0.86266 -0.353175
C  3.322553 1.657396 -0.639589
H  -1.60206 -1.307117 1.567802
H  -0.391963 1.049664 -1.876249
H  2.640195 0.895131 3.087309
H  2.566093 -0.798317 2.461804
H  1.047643 0.071993 2.883377
H  -3.956787 -0.382466 1.375873
H  -2.739857 1.974251 -2.075597
H  -4.506155 1.254096 -0.445297
H  2.889066 2.646273 -0.413323
H  2.796491 1.162006 -1.470526
H  4.399988 1.735564 -0.851424
