program: Gaussian 09
title: 000298053
version: EM64L-G09RevD.01
frameworkgroup: C1[X(C24H24Cl3N3)]
method: RPBEPBE
basis: SDD
operation: Freq
keyword: #p
keyword: freq=noraman
keyword: PBEPBE/SDD
title: #p freq=noraman PBEPBE/SDD
converged: YES YES NO NO
title: Mulliken charges:
elementType: Cl Cl Cl N N N C C C C C C C C C C C C C C C C C C C C C C C C H H H H H H H H H H H H H H H H H H H H H H H H
charge: -0.062302 -0.061568 -0.061953 -0.088933 -0.087190 -0.088167 -0.372916 -0.357973 -0.349795 -0.498401 -0.499565 -0.498419 0.453247 0.453723 0.453099 -0.353290 -0.434321 -0.362928 -0.434012 -0.354601 -0.434167 -0.208903 -0.205741 -0.215181 -0.205244 -0.207680 -0.205957 -0.111985 -0.112639 -0.111226 0.167729 0.278010 0.257597 0.162021 0.156644 0.239100 0.232085 0.198328 0.198754 0.228418 0.229196 0.197859 0.276950 0.237413 0.285348 0.237475 0.277608 0.238368 0.253086 0.254366 0.256004 0.254266 0.253437 0.254923
chargesum: 0.00000
title: Mulliken charges with hydrogens summed into heavy atoms:
elementType: Cl Cl Cl N N N C C C C C C C C C C C C C C C C C C C C C C C C
charge: -0.062302 -0.061568 -0.061953 -0.088933 -0.087190 -0.088167 0.072823 0.061645 0.045949 -0.067988 -0.072394 -0.071364 0.453247 0.453723 0.453099 -0.076340 -0.196908 -0.077580 -0.196536 -0.076992 -0.195799 0.044184 0.048624 0.040823 0.049022 0.045757 0.048966 -0.111985 -0.112639 -0.111226
polarizability: 3.99502716e+02 1.26652642e+01 2.49757825e+02 2.36908896e+01 4.38290280e+01 2.57306950e+02
1716.lowfreq: -3.7540 -0.0013 -0.0012 -0.0004 2.5405 3.7289 9.8338 13.3524 17.2497
frequency: 9.6396 13.3290 17.2063 26.6212 32.0629 35.6796 37.9267 51.0842 57.2880 93.3344 101.3058 128.9820 150.4057 156.8282 161.7564 164.9774 205.7300 229.9772 236.9638 241.2570 286.6102 293.5208 294.5650 316.8827 320.5255 323.8350 335.0860 338.2851 370.0128 394.8369 397.3701 411.0869 411.8004 412.8244 418.7813 436.7102 476.8204 481.3580 483.6538 532.7013 549.2830 615.5802 625.4007 625.5962 634.9897 642.7254 653.7689 662.9546 705.3914 705.6824 710.8831 788.7851 797.7934 801.1496 820.7597 821.5056 822.4042 838.5007 843.0930 844.6121 876.5335 881.9234 905.2104 944.3309 945.3738 946.9277 974.1284 977.3474 978.6582 994.4287 997.1381 998.3176 1000.4693 1001.3104 1002.4173 1022.9805 1026.5715 1068.7228 1069.5013 1069.9045 1071.4798 1092.8505 1096.8742 1105.3753 1109.3815 1111.8066 1131.6015 1166.6236 1172.3550 1175.2038 1175.5923 1176.9339 1192.1552 1203.9815 1207.9555 1208.8156 1237.1662 1241.1869 1256.2147 1272.9444 1285.6185 1290.7890 1294.3795 1296.8504 1304.8375 1322.1609 1339.4751 1345.4744 1369.9027 1379.4191 1381.8992 1384.0412 1393.5544 1394.3357 1399.3924 1416.3795 1417.8290 1456.3020 1460.1653 1465.6609 1471.2437 1472.2640 1475.5322 1476.7614 1478.3837 1479.6135 1588.7308 1588.9618 1589.1127 1601.9609 1602.0365 1602.7752 2662.0212 2665.9214 2692.4003 2845.8012 2849.1634 2850.4273 2987.0484 2988.5104 2989.4115 3029.8596 3050.9080 3063.5865 3122.2341 3123.3346 3123.3774 3143.6311 3144.9093 3145.8861 3166.9755 3167.4811 3168.3343 3170.2172 3171.1284 3171.3476
redmass: 10.7912 11.4799 12.7902 5.0091 4.0206 3.9572 4.8801 6.3472 6.2221 8.3031 7.8649 5.5554 6.3336 5.2309 3.3592 3.5650 4.7499 3.8364 3.7518 4.8813 5.0019 4.7723 5.0068 3.2400 3.2827 4.6282 2.9005 3.0353 3.0240 1.8931 6.0951 3.0482 2.9470 2.9750 5.2028 5.2960 3.2066 3.0433 3.0657 4.8558 5.1962 5.9638 7.0491 7.0496 5.8641 5.4280 4.9448 4.9814 3.7149 3.6709 3.7059 3.5516 3.3737 2.8451 1.5461 1.5820 1.6268 1.2729 1.2759 1.2735 3.4528 3.8889 4.4849 1.3742 1.3556 1.3939 1.6574 1.4937 1.5206 1.5532 2.0088 1.9543 3.7347 3.0598 2.9321 1.6375 1.6019 2.8609 2.6750 2.6385 2.3649 2.0294 1.8129 1.3619 1.7828 2.0275 3.5391 1.6139 1.2980 1.2279 1.2049 1.3157 1.0287 2.9487 2.6841 2.7609 2.9842 1.3180 1.4434 1.5450 1.2518 1.2651 1.2436 1.4323 1.4026 1.5683 1.9121 2.1177 1.4721 4.0523 3.5642 4.9315 2.5063 2.2698 2.2509 1.4694 1.4822 1.1033 1.1274 1.2300 1.2833 1.4636 1.7300 1.8362 1.4216 1.2290 7.4516 7.4565 7.4529 6.2841 6.2467 6.2290 1.0684 1.0685 1.0674 1.0707 1.0706 1.0706 1.0861 1.0859 1.0862 1.0860 1.0859 1.0872 1.0899 1.0899 1.0899 1.0890 1.0889 1.0891 1.0954 1.0954 1.0952 1.0962 1.0958 1.0961
irintensity: 0.3587 0.2702 0.0666 0.1987 0.0376 0.1627 0.4938 0.0211 0.2589 0.1229 0.0681 0.3300 1.5064 2.0850 0.3391 0.2950 1.8330 0.6890 0.4414 0.0978 1.5527 3.4436 2.1942 1.9158 1.2981 0.7767 2.2327 1.7030 5.3481 4.4634 9.9488 1.2652 0.7127 1.9461 19.6768 17.2812 15.6376 38.9331 19.1002 4.1201 6.9859 9.1908 0.1167 0.0091 17.9771 9.4078 6.5886 7.0168 5.8256 0.7419 1.0772 28.6882 21.1983 1.0056 49.9642 85.2693 20.6196 17.0971 18.3395 9.6940 1.3557 4.7596 74.3170 5.4334 3.2479 6.4440 13.6229 1.8581 4.9838 0.9374 12.7095 5.4959 49.4180 48.2422 54.1952 4.2875 4.8622 41.7157 3.0567 45.9698 12.9848 66.9673 84.9368 13.6039 31.9202 86.6885 3.9523 71.4293 24.0309 5.7668 5.5533 8.2420 0.6320 0.2108 7.8854 7.2076 5.9189 28.8720 39.1739 11.2204 9.8050 10.1978 12.0027 11.3449 2.3285 36.8626 67.5133 17.6699 1.0337 23.1880 3.6913 8.3964 22.4358 13.6485 4.0573 1.5506 5.4926 9.1307 17.6325 47.0050 21.2842 2.2798 82.1668 86.6579 9.4370 9.7226 3.4600 2.8556 2.4307 0.2897 5.8889 12.5858 31.7360 24.9855 321.7221 77.9562 83.4643 135.3333 17.8844 17.7637 18.3837 36.0387 24.3391 13.9041 10.4746 7.6989 15.2733 0.3594 0.4363 0.1747 2.8246 9.4017 6.1338 1.6521 2.8118 2.2174
temp: 298.150 k
press: 1.00000 atm
elementType: 17 17 17 7 7 7 6 6 6 6 6 6 6 6 6 6 6 6 6 6 6 6 6 6 6 6 6 6 6 6 1 1 1 1 1 1 1 1 1 1 1 1 1 1 1 1 1 1 1 1 1 1 1 1
symmnumber: 1
zpe: 1111384.2 jmol-1
zpe.correction: 0.423304 hartree
zpe.thermalcorrener: 0.450910 hartree
zpe.thermalcorrenthalpy: 0.451854 hartree
zpe.thermalcorrgfe: 0.359225 hartree
zpe.sumelectzpe: -2471.180563 hartree
zpe.sumelectthermal: -2471.152957 hartree
zpe.sumelectthermalent: -2471.152013 hartree
zpe.sumelectthermalfe: -2471.244642 hartree
dipole: -2.3303 -3.7161 -5.1082
dipole: 6.7330
quadrupole: -232.6423 -197.6475 -186.3943
quadrupole: 3.0395 2.5601 3.9887
quadrupole: -27.0810 7.9139 19.1670 3.0395 2.5601 3.9887
hfenergy: -2471.6038672 hartree
pointgroup: C01 [X(C24H24Cl3N3)]
dipole: -0.9006728 -1.1975078 -2.1844462 debye
polarizability: 398.7102819|4.8531158|239.4520159|28.9097447|41.2698614|268.4051936 unknown
InChI: InChI=1S/C24H24Cl3N3/c25-22-7-1-19(2-8-22)13-28-16-29(14-20-3-9-23(26)10-4-20)18-30(17-28)15-21-5-11-24(27)12-6-21/h1-12H,13-18H2
charge 0 multiplicity 1
54 atoms
Cl 4.562079 4.582869 1.476238
Cl 6.551718 -1.934965 2.194328
Cl -7.711611 1.540596 2.185528
N  -0.420334 0.466813 -0.95424
N  0.27068 -1.834054 -0.66274
N  -2.082677 -1.264306 -0.652426
C  0.581931 -0.550547 -1.324218
C  -1.777092 0.021668 -1.315498
C  -1.086514 -2.291335 -1.017993
C  -0.095909 1.813008 -1.471518
C  1.300698 -2.866562 -0.906545
C  -3.470915 -1.710978 -0.897683
C  1.087374 2.455779 -0.752122
C  2.603516 -2.590092 -0.160519
C  -4.502681 -0.86555 -0.155419
C  1.319061 2.206041 0.623459
C  3.843795 -3.002086 -0.705218
C  -4.20035 -0.306954 1.111649
C  1.938276 3.356335 -1.437289
C  2.587409 -1.965395 1.11144
C  -5.795648 -0.670885 -0.698849
C  2.374625 2.846606 1.308498
C  5.051608 -2.811096 0.004401
C  -5.169412 0.427755 1.829432
C  2.996483 4.012391 -0.767715
C  3.783545 -1.759931 1.83287
C  -6.781415 0.056367 0.006942
C  3.195275 3.745803 0.599888
C  4.999078 -2.192276 1.26751
C  -6.449305 0.593883 1.264717
H  0.605962 -0.68764 -2.452725
H  1.579349 -0.210849 -1.002166
H  -2.508452 0.777109 -0.982235
H  -1.880331 -0.092532 -2.442061
H  -1.149327 -2.526251 -2.128951
H  -1.309198 -3.218872 -0.460757
H  -0.994965 2.443283 -1.316302
H  0.100859 1.813549 -2.574306
H  1.522882 -3.002765 -1.996174
H  0.881946 -3.830567 -0.552461
H  -3.541344 -2.75858 -0.540696
H  -3.729202 -1.73283 -1.987902
H  0.666425 1.49523 1.141862
H  3.876307 -3.476816 -1.693706
H  -3.192452 -0.447885 1.516613
H  1.779858 3.55342 -2.504744
H  1.625955 -1.633482 1.517947
H  -6.043798 -1.087538 -1.68284
H  2.555104 2.652064 2.36989
H  6.008835 -3.129988 -0.418087
H  -4.934978 0.860391 2.806485
H  3.652601 4.708352 -1.298251
H  3.771702 -1.274952 2.813442
H  -7.779832 0.205544 -0.414085
