program: Gaussian 09
title: 000297999
version: EM64L-G09RevD.01
frameworkgroup: C1[X(C14H12O3S)]
method: RPBEPBE
basis: SDD
operation: Freq
keyword: #p
keyword: freq=noraman
keyword: PBEPBE/SDD
title: #p freq=noraman PBEPBE/SDD
converged: YES YES NO NO
title: Mulliken charges:
elementType: S O O O C C C C C C C C C C C C C C H H H H H H H H H H H H
charge: 0.646285 -0.266667 -0.610763 -0.222088 -0.159182 -0.502861 0.256012 -0.256250 -0.223794 0.210286 -0.205961 -0.207136 -0.348882 -0.343164 -0.223101 -0.214147 -0.215432 -0.220976 0.281359 0.309735 0.254768 0.303324 0.234269 0.235887 0.272641 0.274208 0.231700 0.237680 0.235600 0.236651
chargesum: 0.00000
title: Mulliken charges with hydrogens summed into heavy atoms:
elementType: S O O O C C C C C C C C C C C C C C
charge: 0.646285 -0.266667 -0.610763 -0.222088 -0.159182 0.088233 0.256012 -0.001482 0.079530 0.210286 0.028307 0.028750 -0.076241 -0.068956 0.008599 0.023533 0.020169 0.015675
polarizability: 2.31970098e+02 2.60805408e+01 1.76959921e+02 -2.99362821e+01 1.65536967e+01 1.31440954e+02
1716.lowfreq: -7.9043 -6.4113 -1.3376 -0.0016 0.0006 0.0012 15.1074 26.4903 35.3700
frequency: 14.5440 26.2883 35.3494 57.8528 66.0300 96.1439 144.0186 155.0234 170.3583 189.6033 220.5711 264.0145 300.0760 315.3889 381.2774 403.4726 405.1426 410.5744 436.6603 470.0884 486.3345 580.1595 605.7582 613.3360 652.1213 655.2206 673.2823 697.4845 700.4911 739.3649 753.4135 794.5444 796.8798 856.5344 865.9847 920.8860 936.1402 949.4045 957.1631 978.8813 985.8348 989.2045 997.7122 1003.2328 1006.6487 1010.8755 1013.5053 1030.1772 1046.2733 1074.3492 1086.8338 1171.2944 1175.3288 1175.8048 1180.3167 1189.3384 1225.9777 1265.9695 1300.4629 1317.3678 1384.4894 1390.6790 1400.5864 1431.9424 1438.3692 1454.2061 1477.8350 1582.8554 1586.3551 1600.3108 1610.6546 1649.8266 3049.4890 3119.8390 3128.3341 3133.1251 3137.4087 3145.6644 3151.7152 3157.5726 3163.2804 3166.7984 3169.3542 3180.8842
redmass: 5.7506 4.6948 5.1372 5.9462 5.2054 7.7671 4.9996 6.5150 5.4912 6.1511 5.9197 6.5438 7.4327 4.6458 5.5894 2.8284 3.1595 7.1893 3.8080 5.1120 4.1781 7.7928 6.4797 6.4368 5.8374 6.5846 5.1857 2.2906 1.7241 4.3853 1.4925 2.1189 14.4818 1.2429 1.2443 1.5010 1.4454 6.5191 1.4165 5.8293 1.3899 6.2836 1.3912 3.7560 1.5170 1.3371 4.1100 2.1299 2.1570 1.5645 1.5791 1.0685 1.1187 1.0578 1.1751 1.1489 2.2911 1.4502 1.3103 1.3143 9.0556 9.7163 1.1022 2.1869 2.2418 2.0467 2.2606 5.8712 6.3293 6.7509 6.0141 11.2706 1.0515 1.0886 1.0867 1.0858 1.0907 1.0892 1.0958 1.0940 1.1162 1.1013 1.0981 1.0978
irintensity: 0.3544 0.4599 0.6116 1.3579 0.9512 0.4395 1.1311 4.6630 4.5134 8.3456 1.4649 15.3756 3.0477 10.9537 1.2226 0.0408 1.7800 11.4559 0.5222 7.9787 11.6825 0.9886 0.0198 1.1149 4.9137 1.0335 24.5259 59.9888 53.4705 58.8002 48.4810 35.4268 54.8949 0.5783 0.0666 3.1457 4.8005 16.8585 5.3166 12.4192 0.5628 35.0306 0.4268 185.5534 61.5884 0.3747 128.5528 41.9765 15.2309 7.1718 10.5298 1.8453 6.4427 0.1846 61.9200 2.7745 123.1385 70.2491 2.9152 1.1729 1.6801 2.6357 28.3999 12.8619 14.8993 15.2214 4.0595 4.2761 10.7667 2.4193 15.1720 158.2392 13.7804 6.2244 0.8659 0.2105 1.0879 9.8600 23.5398 14.5152 3.4917 26.8031 17.8927 7.3385
temp: 298.150 k
press: 1.00000 atm
elementType: 16 8 8 8 6 6 6 6 6 6 6 6 6 6 6 6 6 6 1 1 1 1 1 1 1 1 1 1 1 1
symmnumber: 1
zpe: 584578.8 jmol-1
zpe.correction: 0.222654 hartree
zpe.thermalcorrener: 0.239174 hartree
zpe.thermalcorrenthalpy: 0.240118 hartree
zpe.thermalcorrgfe: 0.175426 hartree
zpe.sumelectzpe: -1163.061635 hartree
zpe.sumelectthermal: -1163.045116 hartree
zpe.sumelectthermalent: -1163.044171 hartree
zpe.sumelectthermalfe: -1163.108863 hartree
dipole: 5.6855 2.3534 -1.8748
dipole: 6.4326
quadrupole: -115.1284 -102.9378 -111.9606
quadrupole: -7.1501 -5.7670 3.5025
quadrupole: -5.1195 7.0712 -1.9517 -7.1501 -5.7670 3.5025
hfenergy: -1163.2842892 hartree
pointgroup: C01 [X(C14H12O3S1)]
dipole: 1.9871023 1.538362 -0.2995104 debye
polarizability: 215.9132816|47.8916319|171.3056976|-21.6464033|24.0665168|153.1519932 unknown
InChI: InChI=1S/C14H12O3S/c15-14(12-7-3-1-4-8-12)17-11-18(16)13-9-5-2-6-10-13/h1-10H,11H2
charge 0 multiplicity 1
30 atoms
S  -2.438229 -1.514199 -1.355027
O  0.32303 -1.652355 -0.644829
O  -3.701276 -2.40531 -0.7089
O  0.382984 -1.047348 1.622271
C  -2.416952 0.091432 -0.335671
C  -0.897966 -2.38125 -0.43353
C  2.067696 -0.163468 0.087306
C  -1.564141 1.154656 -0.686017
C  -3.331949 0.160408 0.726868
C  0.870941 -0.950699 0.477457
C  -1.616789 2.335243 0.09368
C  -3.375527 1.346046 1.494679
C  2.729144 0.578772 1.101858
C  2.557165 -0.137714 -1.245594
C  -2.517872 2.427837 1.180589
C  3.869904 1.342606 0.78405
C  3.699996 0.628081 -1.556672
C  4.357121 1.368871 -0.545091
H  -0.832219 -3.359473 -0.929559
H  -1.208703 -2.428493 0.622074
H  -0.878798 1.079179 -1.537991
H  -3.98383 -0.701582 0.920181
H  -0.958993 3.176253 -0.151093
H  -4.076542 1.426509 2.332521
H  2.334819 0.542713 2.12265
H  2.045591 -0.71984 -2.016674
H  -2.556362 3.345077 1.778734
H  4.37981 1.914388 1.566548
H  4.080414 0.647141 -2.583483
H  5.245136 1.961918 -0.790737
