program: Gaussian 09
title: 000297988
version: EM64L-G09RevD.01
frameworkgroup: C1[X(C9H9N3O2)]
method: RPBEPBE
basis: SDD
operation: Freq
keyword: #pfreq=noraman
keyword: PBEPBE/SDD
title: #p freq=noraman PBEPBE/SDD
converged: NO YES NO YES
title: Mulliken charges:
elementType: O O N N N C C C C C C C C C H H H H H H H H H
charge: -0.234728 -0.285817 -0.256725 -0.023901 0.000234 0.474217 0.050397 -0.432833 -0.151419 -0.434276 0.229303 -0.279333 -0.222754 -0.668372 0.275254 0.312792 0.258209 0.230114 0.230113 0.250065 0.209476 0.234991 0.234993
chargesum: 0.00000
title: Mulliken charges with hydrogens summed into heavy atoms:
elementType: O O N N N C C C C C C C C C
charge: -0.234728 -0.285817 -0.256725 -0.023901 0.000234 0.474217 0.050397 -0.157579 0.161373 -0.176067 0.229303 -0.029268 0.237472 0.011087
polarizability: 1.99701101e+02 4.92634962e+00 1.33238778e+02 -2.48818530e-04 4.77784998e-04 5.79912976e+01
1716.lowfreq: -7.9633 -6.2982 -0.0009 -0.0007 0.0007 7.3331 39.7889 72.2025 93.1378
frequency: 39.5096 72.1423 93.1089 93.7676 145.4926 204.2231 208.5557 241.7375 284.6718 291.0190 375.0700 395.7731 421.8478 510.9365 573.9324 584.5346 639.9827 640.6192 720.8114 750.0035 765.9746 787.0215 799.6051 818.0106 819.8387 842.9403 885.2928 917.0797 956.1799 970.1429 1014.0703 1032.3524 1113.2534 1134.2182 1148.2352 1159.3465 1216.3749 1244.1860 1248.9140 1273.9379 1281.7564 1330.0057 1335.3767 1349.6243 1401.9628 1412.2462 1431.8665 1455.8480 1462.1628 1472.8658 1476.9239 1486.4826 1580.8555 1585.8385 2998.4159 3009.7794 3069.3618 3095.0326 3112.0681 3145.2116 3177.4062 3210.3551 3233.1038
redmass: 3.7998 2.7767 4.3714 4.2277 3.2133 6.1835 5.3113 1.3224 4.6930 5.7283 3.8893 6.8825 2.9326 6.1828 9.5217 4.5933 7.1696 7.4612 5.9954 4.7329 6.4622 7.7247 1.1029 1.3893 4.2037 1.3981 5.9187 1.4393 1.3142 3.3521 2.4877 4.1482 2.2491 1.4563 2.9897 2.0431 2.3697 2.9338 1.1367 9.0133 2.2265 3.1533 1.5790 1.5862 1.2863 2.0637 4.9975 7.1788 1.0394 1.0772 3.9254 1.0850 11.2317 5.9848 1.0362 1.0580 1.1070 1.0985 1.1023 1.0920 1.0904 1.0993 1.0982
irintensity: 0.7494 1.2101 1.4667 0.0200 6.9644 2.2991 2.5744 1.9924 0.8997 14.7855 8.9150 0.4771 7.9857 0.5886 0.1437 6.0066 16.5806 4.4466 0.2490 9.0730 3.6114 3.9488 3.8338 1.7314 0.7209 76.4779 34.7479 6.4577 1.2489 17.3796 4.3564 239.0719 7.3225 5.8957 290.1719 17.2629 174.3026 32.6742 0.0013 47.6850 32.1601 5.3491 61.1113 23.8702 59.6330 0.1783 212.0600 2.7535 12.0485 0.7288 9.0316 16.3647 165.0241 16.7795 21.8647 19.8735 10.6391 28.1349 39.2472 7.8461 12.3964 11.3046 1.3237
temp: 298.150 k
press: 1.00000 atm
elementType: 8 8 7 7 7 6 6 6 6 6 6 6 6 6 1 1 1 1 1 1 1 1 1
symmnumber: 1
zpe: 451884.9 jmol-1
zpe.correction: 0.172114 hartree
zpe.thermalcorrener: 0.184144 hartree
zpe.thermalcorrenthalpy: 0.185088 hartree
zpe.thermalcorrgfe: 0.132918 hartree
zpe.sumelectzpe: -662.035372 hartree
zpe.sumelectthermal: -662.023342 hartree
zpe.sumelectthermalent: -662.022398 hartree
zpe.sumelectthermalfe: -662.074568 hartree
dipole: 0.8859 -0.2902 0.0001
dipole: 0.9322
quadrupole: -75.6272 -79.9779 -81.7042
quadrupole: -6.7370 -0.0001 0.0009
quadrupole: 3.4759 -0.8748 -2.6011 -6.7370 -0.0001 0.0009
hfenergy: -662.2074859 hartree
pointgroup: C01 [X(C9H9N3O2)]
dipole: -0.3478084 -0.1163977 0.0000244 debye
dipolederiv: -2.0988506 0.0990941 0.0003882 0.3700496 -0.4023522 -0.0000934 0.0003742 -0.0000244 -0.2615705 -0.777732 -0.0516808 0.0001006 -0.1490264 -0.910594 0.0000431 0.0001057 -0.0000269 -0.3323357 0.5098405 -0.1279639 -0.000077 0.0425454 -0.4293419 0.0000189 -0.0001133 0.0000495 0.0475254 0.0028415 0.1588569 -0.0000671 0.4796271 -0.056862 -0.0001071 -0.0000752 -0.0000331 -0.2148143 -0.4746583 0.1511934 0.0000323 -0.1563031 -0.3147662 0.0000396 0.0000438 -0.00002 -0.2464794 -0.2934729 0.008982 0.0000995 -0.6071698 0.0272707 0.0001211 0.0001357 0.0000131 0.1441999 -0.7607968 -0.067956 0.0001486 -0.6740224 -0.1218499 0.0001583 0.0001948 -0.0000069 -0.0058179 -0.4457603 -0.1745858 0.0000504 0.2039419 0.1908756 -0.0000817 0.0000561 0.0000521 -0.1612961 -0.2342947 0.1366088 0.0000361 0.053871 0.0215418 -0.0000174 0.0000416 -0.0000264 -0.0397105 0.3378728 0.0430998 -0.0000705 0.1479004 0.2516411 -0.0000496 -0.0000807 -0.0000427 -0.037748 2.5740379 0.0883149 -0.0005216 0.1165655 1.1059455 -0.0000235 -0.000554 0.0000115 0.2563181 0.3211346 -0.2405737 -0.0000685 0.1279026 0.2736821 -0.0000367 -0.0000818 0.0000301 -0.1017185 1.1477644 0.0470299 -0.0001521 0.2385425 0.2512757 -0.0000527 -0.0001418 -0.0000145 0.3543198 -0.127029 0.0762056 0.0000323 0.041736 0.0115788 0.0000024 0.0000224 -0.0000055 0.0533773 0.0756837 -0.0386601 0.0000307 -0.0480688 0.0152825 0.000025 0.0000244 -0.0000039 0.1836105 0.1544564 -0.0506398 0.0000065 0.0118516 0.1122235 0.0000003 0.000015 0.0000093 0.1861084 0.0493195 -0.0595049 0.0000202 -0.0775538 -0.0161266 0.0000224 0.0000304 0.0000309 0.1348954 -0.0768244 0.0246035 0.0334796 -0.0728305 -0.0046797 -0.0889727 -0.0041985 -0.1013507 -0.0583057 -0.076834 0.024635 -0.0334626 -0.0728047 -0.0046869 0.0890059 0.0042052 0.1013481 -0.0582926 0.0974899 0.0552751 0.0000082 0.0287154 -0.0539929 0.0000019 0.000003 0. 0.1566225 -0.1431458 -0.0839319 0.0000376 -0.1099075 0.0205745 0.0000103 0.0000347 0.0000072 0.1168319 0.1194733 -0.009214 -0.0235535 0.0522068 0.0166852 -0.102267 0.0055318 -0.1095435 -0.0578659 0.1194844 -0.0091881 0.0235021 0.052231 0.016675 0.1022527 -0.0055733 0.1095465 -0.057854 unknown
polarizability: 199.7614551|-4.5004014|133.1784178|-0.0288477|-0.0023044|57.9913036 unknown
InChI: InChI=1S/C9H9N3O2/c1-2-14-9(13)8-11-6-7-5-10-3-4-12(7)8/h3-6H,2H2,1H3
charge 0 multiplicity 1
23 atoms
O  -2.677502 0.241873 0.001211
O  -1.419612 -1.730007 0.000859
N  0.993553 -0.099081 0.000372
N  -0.288636 1.784373 0.000623
N  3.794047 -0.48938 -0.000139
C  1.879438 1.021885 0.000163
C  -0.31525 0.416072 0.000653
C  1.031974 2.162335 0.000196
C  1.504937 -1.39781 0.000315
C  3.281286 0.75533 -0.000076
C  -1.488682 -0.464562 0.000955
C  2.884415 -1.548514 0.000062
C  -3.92295 -0.590978 0.001396
C  -5.094005 0.384941 0.001586
H  1.325755 3.209291 0.000044
H  0.777973 -2.210061 0.000474
H  3.989087 1.590759 -0.000288
H  -3.906406 -1.239045 -0.893714
H  -3.906128 -1.239069 0.896482
H  3.319832 -2.55041 0.000022
H  -6.046073 -0.176614 0.001696
H  -5.068158 1.030208 0.895812
H  -5.068395 1.030264 -0.892605
