program: Gaussian 09
title: 000298009
version: EM64L-G09RevD.01
frameworkgroup: C1[X(C12H11BrN4O4)]
method: RPBEPBE
basis: SDD
operation: Freq
keyword: #p
keyword: freq=noraman
keyword: PBEPBE/SDD
title: #p freq=noraman PBEPBE/SDD
converged: YES YES NO NO
title: Mulliken charges:
elementType: Br O O O O N N N N C C C C C C C C C C C C H H H H H H H H H H H
charge: 0.157545 -0.246502 -0.463975 -0.441721 -0.456155 -0.143395 -0.186516 0.013641 -0.014697 -0.065080 -0.179059 -0.177111 -0.116282 -0.333148 0.200579 -0.340224 0.118793 0.401382 -0.362817 -0.309309 -0.216249 0.243216 0.281160 0.272258 0.257388 0.217055 0.217967 0.365528 0.391340 0.365499 0.280177 0.268714
chargesum: 0.00000
title: Mulliken charges with hydrogens summed into heavy atoms:
elementType: Br O O O O N N N N C C C C C C C C C C C C
charge: 0.157545 -0.246502 -0.098447 -0.050382 -0.090657 -0.143395 -0.186516 0.013641 -0.014697 0.178136 0.102100 0.095147 0.141106 0.101874 0.200579 -0.340224 0.118793 0.401382 -0.082640 -0.040595 -0.216249
polarizability: 2.35946471e+02 3.01429511e+00 2.22924933e+02 4.95571503e+00 -3.10302730e+00 1.00286051e+02
1716.lowfreq: -8.7389 -6.7249 -0.0005 -0.0001 0.0006 6.5045 16.8550 32.7487 50.7956
frequency: 16.0361 32.7286 50.7747 78.2940 90.2909 101.7436 115.5533 125.4114 138.9244 175.2564 191.9334 213.5165 229.1343 242.3603 276.3552 278.9165 294.3365 313.7804 324.9482 367.9038 417.0978 418.7391 427.5573 464.4757 498.9732 504.9710 514.7000 582.9816 607.2879 617.2918 672.4000 685.1472 692.6719 717.2432 735.7841 785.6510 794.5923 807.2349 834.7594 867.9518 885.3488 910.0114 935.1776 939.9776 952.5702 963.9325 991.1108 1004.1813 1033.7433 1052.4118 1057.2774 1083.4520 1100.2096 1137.5617 1169.7715 1189.3135 1192.5715 1210.6714 1232.2687 1249.1900 1262.7450 1271.5995 1284.1997 1298.5687 1307.3001 1315.2411 1339.0826 1358.4428 1362.1693 1386.1689 1391.6180 1411.1962 1433.7544 1456.5512 1499.6053 1520.9734 1537.7209 1570.3527 2190.3548 2910.4648 2980.2980 3036.5354 3044.7641 3056.7451 3061.5621 3067.2800 3154.5884 3183.3076 3477.2717 3574.7203
redmass: 5.9277 6.5566 8.7137 6.9397 4.7054 14.9478 8.9086 6.0167 6.1068 5.5713 4.2820 7.0359 2.3487 2.6435 12.6792 4.8911 4.6741 5.6297 4.1299 6.1499 7.0732 5.0924 5.0328 3.8715 9.2868 5.8028 1.4789 8.7908 4.3645 4.6107 9.4495 10.6693 7.1971 7.4681 5.9840 4.5944 4.3913 5.4448 7.5855 2.6427 1.3228 1.4706 3.3726 4.2347 1.5015 5.2144 2.4033 5.5236 3.3900 4.4485 5.7575 1.8166 4.1969 2.8224 1.4996 3.2451 1.2483 1.4522 1.3643 1.4347 2.2793 1.2818 9.0808 1.5061 1.4765 2.0266 1.7233 1.5317 1.4168 1.3394 1.8209 1.7242 2.2654 1.0771 10.3372 1.1571 8.3293 7.4000 12.6042 1.0721 1.0649 1.0870 1.0885 1.0853 1.0864 1.0976 1.0937 1.0939 1.0665 1.0661
irintensity: 1.8874 1.3287 10.4876 7.0718 14.3940 2.3338 0.2193 0.8485 0.2652 5.1297 28.9223 11.0298 109.2039 172.3222 5.6125 8.6541 16.7218 8.5627 4.4487 8.5126 5.0309 1.9024 8.5477 18.5297 2.0871 12.3514 67.3772 28.5113 1.8754 6.9417 9.2377 0.9603 5.1690 9.6366 39.5655 4.6969 20.6430 1.6879 45.8357 33.2383 98.0113 4.0953 35.9934 44.7012 1.0738 163.2380 62.1977 8.5199 70.1489 43.3322 57.8065 8.9808 12.0453 54.3229 37.6144 82.7908 1.9247 43.7267 8.2778 26.1245 59.0520 3.5328 21.6474 19.5632 9.0671 25.5269 26.6997 2.5800 1.4011 95.8195 54.9232 8.0006 83.0414 7.8250 35.6489 41.0711 54.9916 22.8833 54.7307 1201.6250 52.6750 25.3145 11.9978 3.7535 6.3089 27.7176 3.6239 2.7241 45.4429 22.3086
temp: 298.150 k
press: 1.00000 atm
elementType: 35 8 8 8 8 7 7 7 7 6 6 6 6 6 6 6 6 6 6 6 6 1 1 1 1 1 1 1 1 1 1 1
symmnumber: 1
zpe: 594195.0 jmol-1
zpe.correction: 0.226317 hartree
zpe.thermalcorrener: 0.245231 hartree
zpe.thermalcorrenthalpy: 0.246175 hartree
zpe.thermalcorrgfe: 0.177062 hartree
zpe.sumelectzpe: -995.655457 hartree
zpe.sumelectthermal: -995.636543 hartree
zpe.sumelectthermalent: -995.635598 hartree
zpe.sumelectthermalfe: -995.704711 hartree
dipole: 1.5820 -0.3085 1.1302
dipole: 1.9686
quadrupole: -162.9288 -136.4201 -127.4620
quadrupole: -0.1604 -0.2136 -5.1017
quadrupole: -20.6585 5.8502 14.8083 -0.1604 -0.2136 -5.1017
hfenergy: -995.8817735 hartree
pointgroup: C01 [X(C12H11Br1N4O4)]
dipole: 0.6268571 0.0867074 -0.4465299 debye
polarizability: 234.950396|-3.8584073|223.34512|-7.2207003|7.6872983|100.8619387 unknown
InChI: InChI=1S/C12H11BrN4O4/c13-10-5(1-14)6-2-15-4-16-11(6)17(10)12-9(20)8(19)7(3-18)21-12/h2,4,7-9,12,18-20H,3H2
charge 0 multiplicity 1
32 atoms
Br -1.388747 3.224691 0.268404
O  1.661587 0.478886 1.237499
O  2.685792 1.785646 -1.440111
O  2.421755 -1.91601 -1.017625
O  4.644001 1.3685 0.63439
N  -0.388656 0.491589 -0.046945
N  -0.142161 -1.96131 -0.249261
N  -2.226925 -3.223544 -0.103067
N  -5.13875 1.454785 0.511234
C  1.027718 0.949536 0.017104
C  1.9451 0.537524 -1.161755
C  2.866959 -0.603191 -0.612535
C  2.862242 -0.384818 0.928816
C  4.114518 0.306951 1.491108
C  -0.864221 -0.826792 -0.086237
C  -1.513104 1.324345 0.143343
C  -2.290974 -0.814204 0.066087
C  -2.694374 0.57037 0.206897
C  -2.941287 -2.068969 0.050056
C  -0.871918 -3.11804 -0.248269
C  -4.016242 1.06438 0.373007
H  0.975237 2.05089 0.044741
H  1.398858 0.196356 -2.05997
H  3.888415 -0.488022 -1.013026
H  2.6953 -1.344801 1.449435
H  4.930564 -0.432555 1.573549
H  3.87829 0.690858 2.504651
H  3.424094 1.59715 -2.073136
H  1.455456 -2.033886 -0.695809
H  3.897618 1.936831 0.301058
H  -4.025974 -2.168104 0.159348
H  -0.313772 -4.048238 -0.379986
