program: Gaussian 09
title: 000026864
version: EM64L-G09RevD.01
frameworkgroup: C1[X(C11H9ClN2O2)]
method: RPBEPBE
basis: SDD
operation: Freq
keyword: #p
keyword: freq=noraman
keyword: PBEPBE/SDD
title: #p freq=noraman PBEPBE/SDD
converged: YES YES NO NO
title: Mulliken charges:
elementType: Cl O O N N C C C C C C C C C C C H H H H H H H H H
charge: -0.058722 -0.201224 -0.219034 -0.203836 -0.451898 0.362290 0.091109 0.183445 -0.386390 0.359808 -0.603913 -0.352895 -0.352938 -0.197746 -0.197741 -0.103425 0.333863 0.236585 0.263476 0.252023 0.251510 0.242299 0.242291 0.255528 0.255534
chargesum: 0.00000
title: Mulliken charges with hydrogens summed into heavy atoms:
elementType: Cl O O N N C C C C C C C C C C C
charge: -0.058722 -0.201224 -0.219034 -0.203836 -0.118036 0.362290 0.091109 0.183445 -0.149805 0.359808 0.163096 -0.110596 -0.110647 0.057783 0.057793 -0.103425
polarizability: 2.43949948e+02 -1.17431587e+01 1.10717398e+02 5.19849474e-02 1.08448351e-01 1.03557291e+02
1716.lowfreq: -57.0905 -4.1094 -0.0016 0.0012 0.0017 6.3014 10.2435 30.5714 38.1370
frequency: -57.0771 29.2877 38.1120 44.5527 104.5046 118.6566 161.3845 212.0613 222.2330 258.8253 262.3538 286.1764 357.2366 377.3479 406.4023 408.9635 440.8471 479.0315 527.4309 558.2382 592.7746 624.2989 655.4098 679.8201 706.1878 709.6866 733.4427 755.8337 806.4302 820.9746 833.2467 854.5345 923.0352 950.9559 965.2568 999.5021 1023.3234 1072.6127 1104.6742 1132.0687 1159.2967 1183.9472 1200.8177 1223.6444 1238.9059 1289.1191 1312.4724 1348.9749 1363.4463 1379.6246 1386.9617 1440.3687 1471.1216 1475.9919 1483.9716 1576.4337 1597.9008 1643.8648 1688.5104 1708.7673 3004.0215 3078.0855 3097.6345 3120.4227 3144.3117 3145.4268 3171.9380 3175.3821 3605.4607
redmass: 3.9329 1.0278 9.7369 12.2275 4.1694 7.9231 10.8777 9.4831 4.6248 3.4313 5.6652 7.3364 9.9208 2.6994 2.8500 8.2851 7.2979 3.8329 1.1052 4.7920 7.7069 6.7483 7.4898 4.1793 5.7559 10.3295 4.3563 8.7558 2.0790 1.4980 1.3732 2.6838 2.8490 1.3565 1.3675 4.2279 3.5703 2.6706 1.3637 1.3105 4.5334 1.1345 1.9798 2.5252 2.4706 1.2510 2.7040 5.2950 4.5413 1.8393 3.6954 1.3041 1.0423 2.5551 1.0715 7.7284 6.4123 10.6782 9.8389 9.2715 1.0328 1.0883 1.1026 1.1019 1.0895 1.0893 1.0959 1.0970 1.0805
irintensity: 0.4450 0.0531 0.1180 0.0045 4.1314 0.6095 4.1943 0.9987 1.9806 6.5093 1.6719 0.4416 25.4235 0.1253 0.1880 10.0275 0.0136 34.6538 116.0225 2.2852 22.5684 0.3938 3.3460 2.5734 8.0611 11.2686 25.2565 14.3728 40.1386 18.6788 17.4154 40.7199 9.3020 0.1785 0.3560 62.4742 113.4314 41.1526 10.1345 0.1228 89.3109 0.4782 46.2379 18.4194 29.0428 0.0867 86.4620 0.1387 199.3989 13.7796 4.6025 116.7704 16.9011 64.6369 11.0538 0.9724 16.0261 515.1575 2.0320 380.9373 31.6028 30.3635 16.2564 0.9426 6.1975 6.2235 7.7422 0.4314 58.2300
temp: 298.150 k
press: 1.00000 atm
elementType: 17 8 8 7 7 6 6 6 6 6 6 6 6 6 6 6 1 1 1 1 1 1 1 1 1
symmnumber: 1
zpe: 472253.0 jmol-1
zpe.correction: 0.179872 hartree
zpe.thermalcorrener: 0.193694 hartree
zpe.thermalcorrenthalpy: 0.194638 hartree
zpe.thermalcorrgfe: 0.137241 hartree
zpe.sumelectzpe: -1143.472402 hartree
zpe.sumelectthermal: -1143.458580 hartree
zpe.sumelectthermalent: -1143.457636 hartree
zpe.sumelectthermalfe: -1143.515033 hartree
dipole: 0.9802 -2.3938 0.0038
dipole: 2.5867
quadrupole: -123.3426 -92.0261 -91.5227
quadrupole: 4.9157 0.0067 0.0108
quadrupole: -21.0455 10.2711 10.7744 4.9157 0.0067 0.0108
hfenergy: -1143.6522738 hartree
pointgroup: C01 [X(C11H9Cl1N2O2)]
dipole: -0.3540231 -0.9541232 0.0006424 debye
dipolederiv: -0.8350577 -0.2570752 0.0003837 -0.3264712 -0.1821692 0.0001649 0.0005182 0.000172 -0.1306373 -0.8111403 -0.2348945 0.0003132 -0.1505468 -0.7531964 0.000879 -0.0000926 -0.0001606 -0.2792536 -1.580271 -0.1000323 0.00074 -0.145545 -0.5249371 0.000573 0.001817 0.0005147 -0.3573271 -1.3636094 -0.3439446 -0.0000872 -0.1133473 -0.8582149 0.0029611 0.0034304 -0.0005879 -0.2145739 -1.5171273 0.3100425 -0.000595 0.2442496 -0.6288335 0.0002083 -0.0000228 0.0000544 -0.3517922 0.886524 0.1801334 0.0001468 0.6584924 -0.3001343 0.0005276 -0.0023627 0.000741 0.0700429 1.8116986 0.215659 -0.0000342 -0.2653891 0.8721199 -0.0014865 0.0013282 -0.0008614 0.2147774 2.1936384 0.1385934 -0.0013425 -0.0745507 1.4355417 -0.0026485 -0.0017886 -0.0025742 0.2912881 0.0912369 -0.0742251 0.0002133 0.2635327 0.1217709 -0.0006456 -0.0004458 -0.0004628 -0.2158172 0.2796701 0.0001537 -0.000007 0.0798171 -0.0621272 0.0000572 -0.0006141 0.0001059 -0.0381389 0.1675497 -0.1617374 0.001515 -0.2987834 0.3568951 -0.0043754 0.000797 -0.0038894 0.2162653 -0.1269954 0.0840786 0.0635027 -0.0061823 -0.084083 -0.0031979 -0.1043222 0.0086651 0.090464 -0.1263957 0.0840002 -0.0634455 -0.007204 -0.0840802 0.0031337 0.1047207 -0.008707 0.0906365 -0.3258355 -0.0559711 -0.0688079 -0.0858397 -0.1214534 -0.0386628 -0.0331297 -0.0436356 -0.0064937 -0.3260461 -0.0558311 0.0690773 -0.0854291 -0.1215399 0.0387756 0.0336758 0.0437667 -0.0067382 1.1582639 0.4503696 -0.0006159 0.5227237 0.1297237 -0.0002789 -0.0009162 -0.0003066 0.1216547 0.1524823 0.0441562 0.0000373 0.0466917 0.1946375 0.000234 0.0000586 0.0006165 0.3525407 -0.0492824 -0.0657083 0.0000862 -0.1326805 -0.0832686 0.0004745 0.0008582 0.0004124 0.1664762 0.0757001 -0.1343354 -0.0054813 -0.0241858 0.0399315 -0.0020903 -0.003473 -0.0019759 0.1266556 0.0095443 0.0775816 0.0887055 0.033707 0.064356 0.0275369 0.0984543 -0.0292936 -0.0319797 0.0156066 0.0783791 -0.0841378 0.0410161 0.0593499 -0.022181 -0.0983865 0.0374195 -0.0441856 0.0656331 -0.0574482 -0.0858853 -0.0363534 0.116047 -0.0241188 -0.0867913 -0.0207851 -0.0289494 0.0659727 -0.0574086 0.0858343 -0.0363483 0.116114 0.0241836 0.0867288 0.0207983 -0.0291513 0.0442312 -0.0322363 0.062722 -0.0507081 0.1487809 0.0279241 0.0597594 0.0226361 -0.002964 0.0440089 -0.0322993 -0.0628378 -0.0506657 0.1487699 -0.0279481 -0.0598011 -0.0226623 -0.0027993 unknown
polarizability: 243.0192852|16.1565106|111.6475571|0.0051933|-0.1261338|103.5577954 unknown
InChI: InChI=1S/C11H9ClN2O2/c1-14-10(15)9(13-11(14)16)6-7-2-4-8(12)5-3-7/h2-6,13H,1H3
charge 0 multiplicity 1
25 atoms
Cl 5.530724 0.996564 -0.001246
O  -0.640728 1.616399 -0.000951
O  -4.81795 -0.572103 0.003984
N  -2.893637 0.853527 -0.000425
N  -2.56726 -1.371372 0.002483
C  -1.2695 -0.807837 0.001513
C  -1.486891 0.688658 -0.001689
C  -3.577866 -0.394273 0.001828
C  -0.083547 -1.481924 0.002907
C  1.26845 -0.844309 0.001843
C  -3.578894 2.147081 -0.00158
C  1.931317 -0.560817 -1.219922
C  1.93291 -0.560365 1.222645
C  3.226646 0.001787 -1.22957
C  3.22825 0.002239 1.230398
C  3.855452 0.273521 -0.000045
H  -2.78888 -2.365075 0.004663
H  -0.112457 -2.582441 0.004886
H  -2.80451 2.930318 0.028083
H  -4.235858 2.237369 0.879446
H  -4.189772 2.262956 -0.912586
H  1.429673 -0.768235 -2.171044
H  1.4325 -0.767416 2.174498
H  3.731543 0.227625 -2.173135
H  3.734384 0.228424 2.173216
