program: Gaussian 09
title: 000297977
version: EM64L-G09RevD.01
frameworkgroup: C1[X(C10H13N3O2S)]
method: RPBEPBE
basis: SDD
operation: Freq
keyword: #p
keyword: freq=noraman
keyword: PBEPBE/SDD
title: #p freq=noraman PBEPBE/SDD
converged: YES YES NO NO
title: Mulliken charges:
elementType: S O O N N N C C C C C C C C C C H H H H H H H H H H H H H
charge: 0.311787 -0.234514 -0.240847 -0.085664 0.012658 0.074137 -0.403606 -0.380566 -0.388716 -0.363684 -0.377791 -0.249505 -0.097774 -0.259914 -0.081269 -0.219087 0.229344 0.200173 0.210135 0.212563 0.214534 0.212046 0.212246 0.250006 0.223880 0.229704 0.215971 0.283305 0.290448
chargesum: 0.00000
title: Mulliken charges with hydrogens summed into heavy atoms:
elementType: S O O N N N C C C C C C C C C C
charge: 0.311787 -0.234514 -0.240847 -0.085664 0.012658 0.074137 0.025912 0.042132 0.037864 0.098568 0.075793 -0.033534 -0.097774 0.023391 -0.081269 0.071360
polarizability: 3.98889261e+02 2.04682916e+00 1.49692322e+02 6.04991798e+00 -2.42699920e+00 8.04952111e+01
1716.lowfreq: -9.2141 0.0016 0.0017 0.0019 2.6671 8.4560 31.5792 40.6953 54.0910
frequency: 31.1602 40.6152 53.8893 69.6092 98.0042 153.9364 165.2720 185.5305 196.4648 232.3108 262.1593 299.2107 330.7321 349.2621 377.7393 439.4325 447.2495 457.5063 468.3628 508.7369 561.6061 585.1182 612.3195 666.2025 691.5117 718.2439 733.9201 793.0699 824.4536 833.3047 850.2921 853.6246 857.9787 920.5161 939.1063 948.3931 984.7614 1006.8813 1047.2527 1077.9231 1090.7905 1098.9597 1122.6434 1138.7345 1154.7343 1177.2246 1221.8113 1241.6387 1253.1353 1258.9800 1269.4897 1293.9685 1321.5146 1331.2790 1344.2042 1347.1871 1352.5983 1355.7101 1375.4305 1393.6035 1458.4884 1459.6437 1466.6189 1468.2539 1475.1361 1477.6891 1520.5806 1541.2135 2926.9526 2931.1436 2975.6765 2993.3947 2994.4577 3046.2307 3048.9613 3055.3167 3058.5590 3063.8438 3086.3446 3193.9042 3211.8673
redmass: 4.3646 4.3297 6.0171 5.0842 10.2954 5.8110 4.9645 5.5068 2.3295 3.0961 4.9550 3.4245 3.6132 1.9130 8.7546 3.1817 3.6510 8.2509 4.5118 4.3320 2.3021 3.6776 8.9270 11.1041 5.0214 6.5459 6.5868 1.5292 1.3098 3.6395 1.3861 2.8508 1.5369 2.3526 1.3848 1.3152 2.6457 2.0451 2.0550 3.4831 1.4518 2.0324 2.3133 2.3321 1.3505 2.2306 1.7205 2.4352 2.6484 1.3939 1.2785 1.4238 10.5359 1.2936 1.4011 1.7180 1.5517 2.0030 1.5664 2.5481 1.0897 1.1059 1.0864 1.1023 4.8491 1.1551 4.8111 5.6728 1.0690 1.0701 1.0651 1.0615 1.0610 1.0917 1.0956 1.0997 1.0902 1.1023 1.0922 1.0908 1.1006
irintensity: 1.0554 0.6701 1.9237 0.6814 0.1659 2.9872 2.6472 1.0022 2.5491 14.5588 0.3622 4.7711 9.3975 14.5389 0.3092 1.0959 4.4594 1.2016 11.9697 5.5931 24.3797 5.8728 5.1041 17.1642 4.9730 1.7247 0.2601 0.4132 45.5172 15.6889 51.1190 20.2865 46.2707 6.6227 0.8481 6.5944 106.9812 13.4600 2.0015 178.4024 2.4272 20.0441 25.3034 51.0163 24.6732 172.4961 8.5250 402.3136 491.4482 15.4130 33.5661 19.3287 171.2766 4.4457 2.3301 56.8601 117.8514 51.8042 0.8169 90.5751 9.2338 94.9447 32.2458 16.2489 231.0856 7.9389 117.0722 262.0663 21.0534 110.5588 41.2203 28.5447 33.1955 23.3970 65.5350 37.0404 23.3006 70.3335 14.1615 0.5339 1.0703
temp: 298.150 k
press: 1.00000 atm
elementType: 16 8 8 7 7 7 6 6 6 6 6 6 6 6 6 6 1 1 1 1 1 1 1 1 1 1 1 1 1
symmnumber: 1
zpe: 587794.6 jmol-1
zpe.correction: 0.223879 hartree
zpe.thermalcorrener: 0.238917 hartree
zpe.thermalcorrenthalpy: 0.239861 hartree
zpe.thermalcorrgfe: 0.180020 hartree
zpe.sumelectzpe: -1100.293650 hartree
zpe.sumelectthermal: -1100.278612 hartree
zpe.sumelectthermalent: -1100.277668 hartree
zpe.sumelectthermalfe: -1100.337509 hartree
dipole: 12.1530 0.3409 0.3894
dipole: 12.1641
quadrupole: -126.2371 -97.1968 -102.0335
quadrupole: -7.1520 0.9595 0.0233
quadrupole: -17.7480 11.2923 6.4556 -7.1520 0.9595 0.0233
hfenergy: -1100.5175287 hartree
pointgroup: C01 [X(C10H13N3O2S1)]
dipole: 4.7826741 0.162096 -0.0526576 debye
polarizability: 398.9138287|2.3539959|140.3390362|-4.8904498|-23.8614129|89.8239294 unknown
InChI: InChI=1S/C10H13N3O2S/c14-13(15)10-5-4-9(16-10)8-11-12-6-2-1-3-7-12/h4-5,8H,1-3,6-7H2
charge 0 multiplicity 1
29 atoms
S  -2.288414 -1.111759 0.662402
O  -5.720588 0.793493 -0.100109
O  -5.246579 -1.287679 0.768965
N  2.696757 0.116059 0.047271
N  1.381872 0.450561 -0.017157
N  -4.889424 -0.132669 0.280029
C  5.580483 -0.331729 0.084495
C  4.971219 0.870671 -0.670967
C  4.591977 -1.51795 0.056226
C  3.620089 1.272068 -0.049712
C  3.21459 -1.139334 0.646667
C  0.412733 -0.396988 0.336041
C  -0.958288 0.021422 0.170268
C  -1.475636 1.231707 -0.334744
C  -3.492542 0.132123 0.153806
C  -2.894548 1.292996 -0.342522
H  6.543088 -0.62826 -0.370276
H  5.793777 -0.043287 1.134519
H  5.649873 1.743125 -0.637437
H  4.824347 0.604807 -1.735675
H  4.453369 -1.851614 -0.990141
H  4.990308 -2.378488 0.625561
H  3.791287 1.68928 0.968258
H  3.10114 2.04046 -0.644446
H  2.499856 -1.955218 0.440707
H  3.283446 -1.023031 1.751987
H  0.589405 -1.401637 0.750785
H  -0.819654 2.03138 -0.68187
H  -3.48464 2.141493 -0.692829
