program: Gaussian 09
title: 000298033
version: EM64L-G09RevD.01
frameworkgroup: C1[X(C20H21NO7)]
method: RPBEPBE
basis: SDD
operation: Freq
keyword: #p
keyword: freq=noraman
keyword: PBEPBE/SDD
title: #p freq=noraman PBEPBE/SDD
converged: YES YES NO NO
title: Mulliken charges:
elementType: O O O O O O O N C C C C C C C C C C C C C C C C C C C C H H H H H H H H H H H H H H H H H H H H H
charge: -0.269142 -0.322141 -0.418139 -0.258673 -0.287312 -0.282795 -0.254799 -0.461155 -0.056398 -0.065874 -0.168584 -0.099228 -0.366853 0.271024 -0.502926 0.202745 0.219186 0.484190 -0.342213 -0.336943 -0.442882 -0.350126 -0.220658 -0.219561 -0.194854 -0.212468 -0.226412 -0.255931 0.295352 0.268939 0.285456 0.257431 0.270030 0.223517 0.344322 0.237040 0.210250 0.235816 0.335280 0.268250 0.307564 0.224872 0.291703 0.232757 0.233080 0.228327 0.227070 0.231505 0.230362
chargesum: 0.00000
title: Mulliken charges with hydrogens summed into heavy atoms:
elementType: O O O O O O O N C C C C C C C C C C C C C C C C C C C C
charge: -0.269142 -0.322141 -0.073817 -0.258673 -0.287312 -0.282795 -0.254799 -0.125874 0.238954 0.203065 0.116872 0.158203 0.126694 0.271024 0.180180 0.202745 0.219186 0.484190 -0.073963 -0.029379 -0.218010 -0.058423 0.012099 0.013519 0.033472 0.014602 0.005093 -0.025569
polarizability: 3.33416948e+02 1.15102553e+01 2.23870001e+02 -5.87460521e+00 4.30196058e+00 1.84126512e+02
1716.lowfreq: -5.3381 -0.0006 -0.0003 0.0008 1.5425 5.1363 9.3602 16.4662 19.8799
frequency: 5.5217 16.0797 19.8133 29.4466 35.2320 42.8106 63.9509 67.7990 77.1019 83.1061 91.6554 104.5235 122.4876 134.5223 152.4861 169.8840 197.8149 205.6215 219.6319 231.5394 252.6541 277.8082 299.6608 323.5228 343.0885 361.7406 368.0850 393.2925 405.5352 407.6976 408.0663 438.2667 444.9357 492.1970 509.2457 513.2422 568.3312 596.6620 613.0168 615.8368 649.0744 652.9074 674.7194 678.0833 694.4934 698.6626 701.8918 705.8073 756.9659 767.2995 772.3249 796.5125 831.6451 842.3717 857.2636 869.8658 894.0906 899.4102 915.2354 916.5381 930.9911 945.9524 961.0568 963.1559 973.3957 985.0589 989.5109 996.8239 1000.3269 1002.2821 1015.5081 1018.7349 1022.9191 1033.0554 1043.0874 1051.1793 1064.3064 1088.1125 1091.3029 1096.0143 1113.5663 1126.0603 1146.9805 1158.2919 1173.4378 1173.9379 1188.9300 1190.5457 1190.8892 1216.4144 1222.5241 1237.8856 1258.3516 1260.0232 1272.1601 1298.3241 1314.8941 1321.4895 1326.7397 1329.5647 1356.2191 1359.0042 1377.5744 1387.0739 1389.8003 1431.3668 1435.1052 1437.4789 1456.4059 1477.2336 1477.6659 1480.5232 1486.1243 1518.8592 1584.9600 1602.3081 1610.4679 1617.4991 1629.0053 1669.6456 2959.5465 3018.6822 3020.6701 3036.7730 3055.1140 3056.7977 3097.8026 3115.7562 3124.0022 3129.6531 3129.9564 3133.2364 3143.0835 3145.5856 3154.9477 3166.4460 3166.5064 3175.0455 3187.5005 3527.9590 3536.6740
redmass: 6.0810 6.4126 5.7787 4.5551 4.8514 5.2786 4.6367 5.4597 7.1260 4.6050 7.1358 3.0092 3.3982 6.0666 2.4858 1.9348 4.2044 4.7219 5.8050 6.2723 4.4813 5.1818 5.5182 5.3449 6.7518 1.6438 3.7825 2.3743 4.0519 4.0701 2.9576 3.6000 3.9012 6.6066 2.9177 5.3811 5.5787 6.3425 6.4322 6.4256 1.4842 5.7405 5.9121 5.1422 2.6427 2.6353 6.2216 1.7054 5.9178 1.6630 5.9620 2.1549 5.0194 1.2704 4.2344 1.2454 3.5280 4.7528 1.9220 3.2004 5.9310 3.3000 3.7627 1.4169 1.3568 6.1344 6.2313 1.3036 4.0790 1.3714 2.7298 1.6666 2.7415 2.7397 4.0262 2.8490 2.6675 1.7209 1.5676 2.6202 1.3005 1.8814 1.4553 3.1193 1.0504 1.0604 1.3313 1.1470 1.2002 1.2859 1.3492 3.1975 2.0076 1.3928 1.3604 1.4033 1.2716 1.3036 1.3858 1.1920 1.3555 1.3308 1.5187 6.6087 9.6395 1.1503 2.3414 2.2486 1.0506 1.3217 1.0742 1.5996 2.2347 2.2060 6.3782 5.2027 5.9967 6.0515 10.5885 9.0202 1.0349 1.0870 1.0601 1.0838 1.0856 1.0998 1.1073 1.0884 1.1014 1.0856 1.0882 1.0870 1.0891 1.0935 1.0939 1.0980 1.0989 1.0992 1.0955 1.0659 1.0761
irintensity: 0.9524 0.8888 0.0722 0.2183 1.4181 1.5310 0.2078 0.6035 0.6507 0.5551 8.1249 6.1026 4.3441 1.1812 0.8974 5.9227 3.1149 1.4894 0.7284 8.7672 3.0339 11.7455 14.3643 6.1965 6.3491 63.1135 7.5246 130.3746 4.5241 4.1574 0.5482 3.3958 0.1384 2.3141 22.7213 13.6998 13.6918 1.3965 0.5146 1.9142 15.5177 3.1386 15.7129 13.0200 1.7087 84.2627 23.0944 86.1617 37.1199 112.3529 14.5002 23.4542 12.5045 0.5554 101.3431 0.8055 4.3544 13.4095 20.0061 4.6795 40.6233 32.7902 215.3851 7.7553 0.4929 0.7821 1.1181 3.9379 42.1896 0.3448 73.5617 55.9303 117.3076 83.8784 203.5990 141.6195 126.9635 1.6190 36.1812 46.6690 1.5919 7.7041 66.8535 295.6201 0.4864 1.7328 58.1807 18.6000 11.1939 16.1751 11.5962 279.8867 14.0865 5.9073 14.2767 0.1163 17.4020 1.2481 40.8192 21.2580 5.1312 30.3297 11.0533 40.8890 5.2459 5.2196 110.3415 20.5093 11.7639 22.0916 13.9921 3.8188 17.2395 492.7611 24.1418 30.3104 16.5828 107.3643 194.4169 265.3775 74.3112 51.0956 23.5091 23.8743 19.9802 40.8752 7.4462 11.9709 19.8718 0.8776 5.9616 0.9496 16.6877 27.7532 17.6066 5.4809 26.8842 19.7667 4.7272 7.9179 31.5189
temp: 298.150 k
press: 1.00000 atm
elementType: 8 8 8 8 8 8 8 7 6 6 6 6 6 6 6 6 6 6 6 6 6 6 6 6 6 6 6 6 1 1 1 1 1 1 1 1 1 1 1 1 1 1 1 1 1 1 1 1 1
symmnumber: 1
zpe: 998516.5 jmol-1
zpe.correction: 0.380315 hartree
zpe.thermalcorrener: 0.406670 hartree
zpe.thermalcorrenthalpy: 0.407614 hartree
zpe.thermalcorrgfe: 0.318199 hartree
zpe.sumelectzpe: -1353.986616 hartree
zpe.sumelectthermal: -1353.960261 hartree
zpe.sumelectthermalent: -1353.959317 hartree
zpe.sumelectthermalfe: -1354.048732 hartree
dipole: -0.5021 -1.9139 -2.4044
dipole: 3.1139
quadrupole: -133.7627 -165.3829 -163.7771
quadrupole: -4.2746 -3.9633 13.6282
quadrupole: 20.5449 -11.0753 -9.4695 -4.2746 -3.9633 13.6282
hfenergy: -1354.3669307 hartree
pointgroup: C01 [X(C20H21N1O7)]
dipole: 0.1117624 0.466198 -1.1274167 debye
polarizability: 332.7616616|12.8888557|218.8879091|-7.6813956|-15.0895921|189.76389 unknown
InChI: InChI=1S/C20H21NO7/c1-25-19-16(22)17(28-20(24)21-14-10-6-3-7-11-14)15(27-19)12-26-18(23)13-8-4-2-5-9-13/h2-11,15-17,19,21-22H,12H2,1H3
charge 0 multiplicity 1
49 atoms
O  -4.247556 -0.462567 0.293641
O  -1.283323 1.280975 -0.198446
O  -3.788719 1.568337 2.494697
O  -4.34173 1.499813 -1.137448
O  -1.001023 -2.048043 1.135733
O  0.5650 1.175482 1.279531
O  -1.154937 -4.221762 0.286391
N  0.701604 2.058733 -0.917993
C  -2.163364 0.677828 0.82158
C  -2.764993 -0.643869 0.257814
C  -3.389858 1.599183 1.084532
C  -4.496897 0.993537 0.200453
C  -2.472266 -1.899273 1.082943
C  0.071486 1.483112 0.16702
C  -5.35374 0.982723 -2.074645
C  -0.44955 -3.266362 0.691071
C  1.037085 -3.253072 0.772234
C  2.06441 2.454539 -1.029244
C  1.729048 -4.43964 0.41099
C  1.760571 -2.101643 1.18285
C  2.491481 2.964781 -2.284265
C  2.984366 2.367086 0.048635
C  3.136847 -4.476557 0.461545
C  3.170277 -2.14582 1.225454
C  3.825441 3.383081 -2.462022
C  4.316615 2.790807 -0.147311
C  3.859899 -3.328726 0.86793
C  4.74874 3.298537 -1.39385
H  -1.576769 0.530761 1.745514
H  -2.428752 -0.775876 -0.786533
H  -3.178997 2.651773 0.854693
H  -5.523444 1.142701 0.587868
H  -2.925445 -2.797423 0.62969
H  -2.825235 -1.784154 2.122905
H  -4.115831 0.656098 2.712309
H  -5.290286 -0.117668 -2.156516
H  -6.374133 1.270227 -1.748814
H  -5.127309 1.450084 -3.044404
H  0.099274 2.209113 -1.730915
H  1.147473 -5.312356 0.095768
H  1.225741 -1.18743 1.456811
H  1.780938 3.031739 -3.118051
H  2.652588 1.97932 1.014069
H  3.670362 -5.392258 0.184765
H  3.729444 -1.255743 1.533353
H  4.142123 3.774246 -3.435069
H  5.02217 2.725208 0.688631
H  4.954938 -3.356215 0.903425
H  5.785035 3.624131 -1.531516
