program: Gaussian 09
title: 000297973
version: EM64L-G09RevD.01
frameworkgroup: C1[X(C18H14N2O2S)]
method: RPBEPBE
basis: SDD
operation: Freq
keyword: #p
keyword: freq=noraman
keyword: PBEPBE/SDD
title: #p freq=noraman PBEPBE/SDD
converged: YES YES NO NO
title: Mulliken charges:
elementType: S O O N N C C C C C C C C C C C C C C C C C C H H H H H H H H H H H H H H
charge: 0.989717 -0.528425 -0.502483 -0.742411 -0.034478 0.376407 0.208446 0.258861 -0.018106 -0.395568 0.278297 -0.371864 -0.437846 -0.373740 -0.235223 -0.246544 0.453175 -0.250193 -0.392031 -0.335689 -0.240259 -0.796200 -0.279157 0.356924 0.272476 0.220615 0.258848 0.262761 0.280783 0.282634 0.248017 0.247572 0.234917 0.236996 0.230544 0.240735 0.241491
chargesum: 0.00000
title: Mulliken charges with hydrogens summed into heavy atoms:
elementType: S O O N N C C C C C C C C C C C C C C C C C C
charge: 0.989717 -0.528425 -0.502483 -0.385487 -0.034478 0.376407 0.208446 0.258861 -0.018106 -0.123093 0.278297 -0.151249 -0.178997 -0.110978 0.045561 0.036091 0.453175 -0.015276 -0.144015 -0.088117 -0.003263 -0.083430 -0.279157
polarizability: 2.93055094e+02 -2.14736459e+01 2.40446700e+02 -9.05126811e+00 -3.62867600e+01 2.17265441e+02
1716.lowfreq: -44.7276 -5.4926 -0.0022 -0.0021 -0.0003 3.8066 11.0802 14.3958 14.7081
frequency: -44.6767 11.0579 14.7001 36.7943 62.3096 88.0892 100.0490 113.6999 130.2516 134.5924 171.3260 183.5342 191.2641 210.3644 232.8274 267.7857 288.2804 299.4893 341.8136 376.1773 387.5383 396.9642 405.9069 418.1607 425.4933 436.8429 463.9246 485.2610 496.0957 504.7594 559.1098 580.1980 596.9495 620.7296 623.8623 650.8436 679.2766 704.8951 710.2224 747.3177 774.8248 776.5776 795.3019 803.0884 808.4744 825.7486 844.5620 859.5145 883.2861 946.1312 959.4481 962.8763 966.0780 982.1121 986.8366 995.8223 998.4998 1006.5118 1039.2656 1050.7786 1051.1943 1054.1674 1120.5854 1160.8018 1182.6184 1185.1100 1193.2744 1218.8992 1243.1998 1264.7780 1272.8912 1297.6460 1322.6046 1367.4440 1382.0910 1391.0447 1391.6417 1402.9254 1417.9151 1445.4824 1455.1589 1469.7909 1471.9183 1474.9030 1524.3655 1574.2553 1590.2875 1593.0207 1596.1107 1624.3884 2164.2805 2985.2829 3064.9270 3095.2120 3131.9839 3138.5646 3139.6144 3142.2742 3152.8211 3153.3056 3164.5655 3167.8184 3169.3685 3171.9724 3512.6036
redmass: 1.0229 5.4728 5.5218 4.3199 6.0513 10.0537 5.3474 3.9896 6.4919 8.3419 6.1743 5.7572 6.2475 10.1009 9.0153 3.2170 6.7203 4.6210 2.2440 3.5022 3.1300 6.8460 2.8575 3.0283 9.1556 6.1221 3.5052 5.7488 5.5097 3.3085 7.5283 6.1130 7.2158 6.5957 3.2320 3.7826 6.0013 3.5381 4.4156 5.7682 2.4691 2.0884 4.9127 2.9563 7.6521 1.3955 1.2788 1.3749 1.8325 11.2395 1.3289 1.3778 1.4051 1.3820 2.2845 2.2540 1.3564 4.2657 2.9746 2.2187 1.6955 2.6480 1.2832 1.5795 1.1271 1.1492 1.4643 3.0429 2.0905 1.6656 1.9816 1.2644 1.8009 3.3895 4.6392 2.2858 2.8156 1.3198 8.4188 2.4790 2.7301 1.0448 2.3692 1.1128 4.0071 5.4968 7.4095 6.1749 6.6805 6.2475 12.6300 1.0376 1.0974 1.0992 1.0850 1.0894 1.0886 1.0890 1.0949 1.0896 1.0958 1.0967 1.1008 1.0963 1.0772
irintensity: 0.4840 1.0123 1.3474 0.2315 1.0057 3.2789 0.7279 3.4253 0.2771 2.4842 0.2601 2.1678 1.0680 5.1115 9.3994 56.7054 5.7464 0.8724 34.1096 8.9481 30.9053 29.8348 0.4698 34.3027 53.3971 39.8260 7.3243 4.2591 12.2335 42.2950 73.7056 8.3147 81.4722 0.4962 3.8463 10.2369 23.3575 27.2703 144.4125 28.2411 26.1511 57.1305 3.4463 18.3304 138.2490 22.3326 12.1191 57.2951 1.4473 56.1556 2.1067 1.0998 2.3067 0.7797 1.6503 6.1046 0.2264 15.0824 10.0354 22.9694 18.8910 22.5693 8.7495 1.9169 1.0539 14.5824 1.5482 7.2998 15.7850 1.6679 50.6639 3.6491 121.4494 28.8631 3.4052 51.3137 19.1767 16.7027 2.7219 31.8642 46.2948 14.7499 19.2513 16.8747 65.7925 62.2203 115.7201 19.3101 2.1115 3.1522 89.6718 19.4130 13.6076 15.5713 0.4121 8.6780 3.4605 7.6321 15.8602 6.7337 0.6946 6.5028 24.7530 0.7433 51.8389
temp: 298.150 k
press: 1.00000 atm
elementType: 16 8 8 7 7 6 6 6 6 6 6 6 6 6 6 6 6 6 6 6 6 6 6 1 1 1 1 1 1 1 1 1 1 1 1 1 1
symmnumber: 1
zpe: 714826.2 jmol-1
zpe.correction: 0.272263 hartree
zpe.thermalcorrener: 0.292516 hartree
zpe.thermalcorrenthalpy: 0.293460 hartree
zpe.thermalcorrgfe: 0.220850 hartree
zpe.sumelectzpe: -1350.562460 hartree
zpe.sumelectthermal: -1350.542207 hartree
zpe.sumelectthermalent: -1350.541263 hartree
zpe.sumelectthermalfe: -1350.613873 hartree
dipole: 4.2579 1.1905 5.2077
dipole: 6.8313
quadrupole: -148.2571 -151.1025 -137.9738
quadrupole: 36.8660 -1.9009 -7.3794
quadrupole: -2.4793 -5.3247 7.8040 36.8660 -1.9009 -7.3794
hfenergy: -1350.8347233 hartree
pointgroup: C01 [X(C18H14N2O2S1)]
dipole: 1.7126233 2.0348313 0.3871529 debye
polarizability: 299.3408768|-12.5571819|188.6273507|3.0447523|4.3160323|262.7990073 unknown
InChI: InChI=1S/C18H14N2O2S/c1-13-6-9-15(10-7-13)23(21,22)20-18-11-8-14(12-19)16-4-2-3-5-17(16)18/h2-11,20H,1H3
charge 0 multiplicity 1
37 atoms
S  2.112888 -1.748227 0.375789
O  3.052169 -2.068445 1.661953
O  1.825173 -2.859741 -0.773848
N  0.575573 -1.224795 1.226015
N  -5.467338 0.429089 -1.665887
C  -0.653549 -0.900377 0.626341
C  -1.651126 -0.222963 1.439743
C  -2.929209 0.109009 0.849803
C  2.682568 -0.168638 -0.475951
C  -0.924412 -1.187604 -0.724733
C  -3.16629 -0.191091 -0.546248
C  -1.412257 0.126879 2.808703
C  -2.163681 -0.820532 -1.304306
C  -3.924429 0.742809 1.662131
C  3.297571 0.814584 0.313792
C  2.514931 -0.061957 -1.865698
C  3.5848 2.15844 -1.736801
C  -2.400833 0.747157 3.577199
C  3.745629 1.985885 -0.336212
C  2.971216 1.119439 -2.487632
C  -3.671589 1.04909 3.000993
C  4.066617 3.42034 -2.427232
C  -4.420624 0.145229 -1.157831
H  0.646612 -1.486527 2.214999
H  -0.199065 -1.75042 -1.318355
H  -0.432758 -0.06239 3.260485
H  -2.353677 -1.058692 -2.355296
H  -4.893234 0.986642 1.212457
H  3.437997 0.667627 1.389264
H  2.065882 -0.879239 -2.438441
H  4.229408 2.77268 0.252853
H  2.852725 1.233223 -3.57121
H  -2.198959 1.011617 4.620485
H  -4.444086 1.531775 3.608679
H  4.523436 4.126645 -1.71443
H  4.819339 3.187083 -3.202928
H  3.231878 3.940994 -2.932046
