program: Gaussian 09
title: 000297939
version: EM64L-G09RevD.01
frameworkgroup: C1[X(C9H14ClNO3)]
method: RPBEPBE
basis: SDD
operation: Freq
keyword: #p
keyword: freq=noraman
keyword: PBEPBE/SDD
title: #p freq=noraman PBEPBE/SDD
converged: YES YES NO NO
title: Mulliken charges:
elementType: Cl O O O N C C C C C C C C C H H H H H H H H H H H H H H
charge: -0.070293 -0.271961 -0.293184 -0.293533 -0.615335 0.184494 0.059611 -0.343701 -0.695561 -0.678391 -0.625624 0.215302 0.303446 -0.519811 0.277342 0.201837 0.259760 0.230866 0.242730 0.209491 0.232958 0.219887 0.223758 0.269961 0.307480 0.286167 0.341409 0.340897
chargesum: 0.00000
title: Mulliken charges with hydrogens summed into heavy atoms:
elementType: Cl O O O N C C C C C C C C C
charge: -0.070293 -0.271961 -0.293184 -0.293533 0.066971 0.184494 0.336952 0.117895 -0.012473 -0.001787 -0.048184 0.215302 0.303446 -0.233644
polarizability: 1.20801042e+02 -2.40960651e+00 1.12788792e+02 -2.94121405e+00 3.92549253e-01 1.25048976e+02
1716.lowfreq: -11.3492 -0.0029 -0.0028 -0.0025 4.4783 8.7830 24.8338 35.3336 36.7526
frequency: 24.5621 35.1172 36.3484 54.7463 61.8652 111.2599 133.7605 154.3618 162.7147 186.4445 193.4890 202.7836 234.5004 283.9626 303.3416 357.2415 376.2523 414.0271 424.4823 451.8279 500.2112 525.5043 535.7832 560.1967 579.7474 618.2247 632.3181 642.2968 668.3266 680.1891 705.1000 765.4390 809.7988 885.0773 922.7281 935.0676 950.3250 975.8309 995.5610 1004.4055 1038.1835 1058.2287 1115.7727 1138.0526 1166.0167 1186.7623 1223.6233 1243.1429 1265.2189 1290.9023 1307.9065 1352.5456 1366.9984 1376.7185 1390.9224 1435.4177 1444.4167 1451.5418 1459.1373 1469.8879 1481.5998 1587.6909 1683.5881 2121.4978 2992.8631 3002.2393 3005.1262 3018.3676 3060.8369 3089.5591 3092.4455 3101.0457 3107.5856 3116.1816 3148.4940 3421.3898 3557.9213 3716.2907
redmass: 5.4452 4.5971 6.4288 6.5121 5.7144 4.9691 4.6441 3.8330 2.7992 1.2038 4.2918 5.2073 1.1203 2.5612 2.2562 2.5481 3.7269 2.9050 4.1352 3.1228 1.1519 1.0936 5.1656 4.6455 5.2244 4.6475 1.2324 5.1043 1.2542 4.6637 11.3103 3.0464 3.1826 1.7554 1.7011 1.8151 4.6496 2.4901 2.9718 1.6253 2.1878 1.9920 2.2454 1.9718 1.1975 3.5192 2.7098 1.5491 1.1930 1.6474 1.3161 2.0526 1.2845 1.2524 1.1994 1.0776 1.0935 1.0498 1.0485 1.0550 1.0501 1.2228 7.1038 6.0330 1.0347 1.0350 1.0603 1.0828 1.0592 1.1020 1.0996 1.1013 1.1004 1.1009 1.1091 1.1586 1.0446 1.1058
irintensity: 0.4244 0.0435 1.7958 1.0472 9.3714 4.8862 4.9290 3.3149 0.4634 0.1905 2.0130 5.8162 1.2797 5.6637 4.0796 0.5396 0.4843 6.0964 19.8004 8.1862 222.2536 86.2971 5.7174 1.5869 24.9818 7.3736 70.9408 12.5498 66.3623 13.0323 38.0881 12.3848 11.4766 2.0179 0.5404 2.9826 93.0092 47.0165 132.5122 31.2769 61.5860 5.2569 23.7527 77.5107 43.6142 25.2627 43.1298 23.0472 0.7591 226.4827 79.9774 154.7923 14.4188 9.5843 18.0603 9.5512 21.0162 9.0048 1.9555 3.5661 14.2150 95.3910 338.4964 0.3336 12.2953 19.2511 24.9312 2.6001 9.9404 15.3546 21.5007 10.1256 34.4130 21.4691 6.4542 61.0037 69.3833 51.7676
temp: 298.150 k
press: 1.00000 atm
elementType: 17 8 8 8 7 6 6 6 6 6 6 6 6 6 1 1 1 1 1 1 1 1 1 1 1 1 1 1
symmnumber: 1
zpe: 575292.2 jmol-1
zpe.correction: 0.219117 hartree
zpe.thermalcorrener: 0.235985 hartree
zpe.thermalcorrenthalpy: 0.236929 hartree
zpe.thermalcorrgfe: 0.172639 hartree
zpe.sumelectzpe: -1090.678570 hartree
zpe.sumelectthermal: -1090.661702 hartree
zpe.sumelectthermalent: -1090.660758 hartree
zpe.sumelectthermalfe: -1090.725048 hartree
dipole: -1.5279 -0.8217 -0.6593
dipole: 1.8559
quadrupole: -82.2346 -89.2742 -86.9607
quadrupole: -10.2435 -5.4729 8.8865
quadrupole: 3.9219 -3.1177 -0.8042 -10.2435 -5.4729 8.8865
hfenergy: -1090.897687 hartree
pointgroup: C01 [X(C9H14Cl1N1O3)]
dipole: 0.4519818 0.4223505 0.3879221 debye
polarizability: 122.5436316|-3.3383505|123.3952436|0.5106586|-2.5746869|112.6999348 unknown
InChI: InChI=1S/C9H14ClNO3/c1-4-9(2,3)13-6-7(5-10)14-8(11)12/h1,7H,5-6,11H2,2-3H3
charge 0 multiplicity 1
28 atoms
Cl -1.776191 -0.482073 -3.214814
O  0.852328 1.282364 0.212493
O  -1.990772 0.365741 -0.026263
O  -2.612063 -1.515378 1.259468
N  -3.802289 0.509906 1.334746
C  2.257245 0.855417 0.509204
C  -0.816302 -0.387144 -0.531763
C  0.211668 0.669493 -0.961059
C  2.510963 1.422652 1.922223
C  3.224676 1.476467 -0.530776
C  -1.221064 -1.363994 -1.634436
C  2.381582 -0.625757 0.511122
C  -2.797729 -0.323564 0.901966
C  2.492268 -1.854474 0.511149
H  -0.410392 -0.995735 0.299478
H  0.9526 0.202894 -1.638272
H  -0.302077 1.481156 -1.501959
H  2.354963 2.514831 1.902998
H  1.806193 0.978204 2.643203
H  3.543461 1.20848 2.246946
H  3.117583 2.574461 -0.508925
H  3.005409 1.118957 -1.551976
H  4.270127 1.210093 -0.295166
H  -0.365506 -1.988685 -1.934796
H  -2.068974 -1.990273 -1.325033
H  2.593452 -2.924599 0.53093
H  -3.85479 1.468246 0.997897
H  -4.480565 0.153114 2.001414
