program: Gaussian 09
title: 000297933
version: EM64L-G09RevD.01
frameworkgroup: C1[X(C13H18)]
method: RPBEPBE
basis: SDD
operation: Freq
keyword: #p
keyword: freq=noraman
keyword: PBEPBE/SDD
title: #p freq=noraman PBEPBE/SDD
converged: YES YES NO NO
title: Mulliken charges:
elementType: C C C C C C C C C C C C C H H H H H H H H H H H H H H H H H H
charge: -0.168758 -0.462563 -0.417392 -0.392851 -0.420293 -0.362997 -0.393917 0.481962 -0.376965 -0.463069 -0.246924 -0.223177 -0.248888 0.191056 0.221709 0.210881 0.206318 0.187722 0.191631 0.200443 0.192715 0.200104 0.190307 0.189413 0.197787 0.188425 0.229208 0.229591 0.220873 0.222018 0.225633
chargesum: 0.00000
title: Mulliken charges with hydrogens summed into heavy atoms:
elementType: C C C C C C C C C C C C C
charge: 0.022298 -0.029973 -0.023352 -0.000777 -0.027474 0.016722 -0.007705 0.481962 -0.147757 -0.233478 -0.026051 -0.001159 -0.023255
polarizability: 1.76213189e+02 -4.09794443e-02 9.88747457e+01 2.97463057e-02 -4.47197837e+00 1.23966598e+02
1716.lowfreq: -0.0006 0.0000 0.0003 5.4067 9.2073 12.5351 27.6723 65.4558 90.3410
frequency: 25.4170 65.4100 90.3089 149.0381 185.4370 227.2063 255.4743 294.8899 320.6454 371.4796 398.6027 402.3693 464.7412 506.5606 530.6177 609.2229 617.1869 706.1290 720.3498 762.6489 767.1160 817.7261 825.5221 851.4025 858.1410 870.2488 897.1603 918.6079 949.2117 973.0653 989.8918 991.6557 1002.2014 1017.9964 1028.1691 1037.1228 1053.8351 1076.1108 1127.8407 1135.0766 1170.0200 1174.0892 1177.9870 1186.8512 1201.2106 1218.5867 1244.3726 1255.3463 1277.1689 1288.6553 1311.7491 1324.2989 1334.8622 1336.3688 1347.9549 1350.4500 1357.8362 1362.5001 1386.0001 1441.1352 1461.7803 1464.1781 1467.1221 1468.7923 1473.4616 1481.3522 1483.3901 1591.3711 1612.2555 2952.1778 2957.6240 2961.1098 2962.4944 2967.3885 2972.7447 2974.5875 3006.2070 3012.6714 3017.6192 3025.1430 3029.1470 3038.1743 3110.8924 3114.5897 3129.5245 3139.8618 3159.5348
redmass: 3.3959 3.0769 3.8241 1.8967 3.1127 3.0109 2.9373 2.3138 2.3993 2.4213 2.9898 2.8184 1.7831 2.0780 3.0232 3.8936 6.2185 1.6734 1.8262 2.1169 2.4098 1.7138 1.4798 1.2553 2.4285 2.1150 2.4480 1.5323 2.2753 1.3873 6.2429 1.3075 1.5126 2.1690 2.0364 1.3985 2.4987 1.5799 2.2835 2.5630 1.0997 1.3661 1.3037 1.1165 1.4621 1.8973 1.2326 1.3811 1.1909 1.3146 1.2203 1.3049 1.4082 1.2972 1.3550 1.4790 1.4853 1.4360 4.5434 2.0978 1.0822 1.0837 1.0892 1.0974 1.0966 2.1242 1.1086 5.9390 6.1492 1.0591 1.0645 1.0668 1.0677 1.0639 1.0696 1.0646 1.0969 1.0995 1.0974 1.1006 1.1017 1.1016 1.0867 1.0862 1.0908 1.0959 1.1014
irintensity: 0.0483 0.0196 0.3177 0.0367 0.0642 0.3757 0.5923 0.1988 0.1051 0.1030 0.1494 0.0539 0.4792 1.1967 14.3076 1.7626 0.1793 54.0062 1.7428 33.5332 14.9236 3.2574 7.4981 0.1019 1.2571 1.2770 4.8973 1.0219 4.5413 0.0622 0.1053 0.0694 3.1725 0.8842 5.9890 2.3593 0.2642 9.7250 1.7392 0.8736 0.0239 1.1451 3.7234 0.0114 0.4456 0.8351 1.8628 1.1298 1.4696 0.1601 0.7763 1.1793 0.5486 1.0992 0.2196 1.0087 0.2227 0.2719 0.2125 8.7907 2.1038 10.2320 4.2356 8.7789 11.9201 20.8159 12.8724 1.8232 12.5692 27.4542 37.7766 18.7139 11.9422 24.2380 28.9990 44.2783 85.5537 7.3377 64.0258 64.4461 44.9586 109.2506 9.8916 6.3569 11.8941 49.2328 27.1502
temp: 298.150 k
press: 1.00000 atm
elementType: 6 6 6 6 6 6 6 6 6 6 6 6 6 1 1 1 1 1 1 1 1 1 1 1 1 1 1 1 1 1 1
symmnumber: 1
zpe: 721793.6 jmol-1
zpe.correction: 0.274917 hartree
zpe.thermalcorrener: 0.286700 hartree
zpe.thermalcorrenthalpy: 0.287644 hartree
zpe.thermalcorrgfe: 0.236376 hartree
zpe.sumelectzpe: -505.193108 hartree
zpe.sumelectthermal: -505.181325 hartree
zpe.sumelectthermalent: -505.180381 hartree
zpe.sumelectthermalfe: -505.231648 hartree
dipole: 0.6473 -0.0314 -0.0155
dipole: 0.6482
quadrupole: -76.4359 -83.2052 -75.1418
quadrupole: -0.0609 -0.0418 -1.2782
quadrupole: 1.8250 -4.9442 3.1192 -0.0609 -0.0418 -1.2782
hfenergy: -505.4680243 hartree
pointgroup: C01 [X(C13H18)]
dipole: -0.2546809 0.0093081 -0.0093547 debye
polarizability: 176.2129017|0.1040467|104.1185877|-0.1157577|11.1388172|118.7230429 unknown
InChI: InChI=1S/C13H18/c1-2-5-9-12(8-4-1)13-10-6-3-7-11-13/h3,6-7,10-12H,1-2,4-5,8-9H2
charge 0 multiplicity 1
31 atoms
C  -0.47947 0.103156 0.21582
C  -1.007892 1.230942 -0.728835
C  -1.15309 -1.283718 -0.02807
C  -2.53483 1.239919 -1.012074
C  -2.453494 -1.478441 0.79263
C  -3.456575 0.872761 0.181046
C  -3.680365 -0.654301 0.333662
C  1.047624 0.041513 0.129018
C  1.694731 -0.532249 -0.998579
C  1.85668 0.575088 1.164109
C  3.103347 -0.575159 -1.084994
C  3.268307 0.538126 1.082045
C  3.898043 -0.038354 -0.044209
H  -0.733597 0.395887 1.255763
H  -0.473179 1.159988 -1.697245
H  -0.706876 2.202566 -0.288204
H  -0.440329 -2.078221 0.266507
H  -1.358964 -1.432969 -1.107885
H  -2.761634 0.540379 -1.842298
H  -2.798279 2.248701 -1.388116
H  -2.228512 -1.237262 1.852984
H  -2.73273 -2.55178 0.774328
H  -4.44606 1.346905 0.023458
H  -3.057957 1.300258 1.124033
H  -4.505719 -0.831994 1.053251
H  -4.032977 -1.044442 -0.644415
H  1.091443 -0.955563 -1.811419
H  1.374995 1.020001 2.044296
H  3.582935 -1.026324 -1.961585
H  3.87357 0.954735 1.895607
H  4.991455 -0.071444 -0.110131
