program: Gaussian 09
title: 000297974
version: EM64L-G09RevD.01
frameworkgroup: C1[X(C19H16N2O2S)]
method: RPBEPBE
basis: SDD
operation: Freq
keyword: #p
keyword: freq=noraman
keyword: PBEPBE/SDD
title: #p freq=noraman PBEPBE/SDD
converged: YES YES NO NO
title: Mulliken charges:
elementType: S O O N N C C C C C C C C C C C C C C C C C C C H H H H H H H H H H H H H H H H
charge: 0.918398 -0.507338 -0.513524 -0.246302 -0.026184 0.127740 0.267692 0.254357 -0.086058 -0.328969 -0.672250 0.276729 -0.373676 -0.448379 -0.254087 -0.212604 -0.385714 0.455589 -0.259480 -0.396188 -0.345232 -0.243104 -0.798327 -0.277293 0.241210 0.214722 0.278259 0.252114 0.311981 0.258075 0.281445 0.292453 0.261089 0.243829 0.245756 0.245678 0.236909 0.244122 0.229057 0.237505
chargesum: 0.00000
title: Mulliken charges with hydrogens summed into heavy atoms:
elementType: S O O N N C C C C C C C C C C C C C C C C C C C
charge: 0.918398 -0.507338 -0.513524 -0.246302 -0.026184 0.127740 0.267692 0.254357 -0.086058 -0.087759 0.072846 0.276729 -0.061695 -0.190304 0.027358 0.079849 -0.124625 0.455589 -0.015652 -0.150432 -0.099554 -0.006196 -0.087642 -0.277293
polarizability: 3.39875777e+02 3.85980168e+01 2.35804901e+02 7.66071081e+00 -1.42463451e+01 2.52083783e+02
1716.lowfreq: -11.7240 -9.5329 0.0006 0.0013 0.0014 3.3572 11.4528 16.2957 20.0889
frequency: -8.3487 15.9306 19.8686 43.4164 53.6636 60.6539 94.1378 120.9794 125.7502 128.2231 143.2321 153.6955 165.5628 186.3618 193.9009 205.0288 220.2053 265.0269 282.9487 294.9434 329.1345 343.5693 377.3120 383.4482 400.6539 407.4795 417.1496 435.2777 443.9716 462.8349 480.7742 500.0378 504.0465 572.5388 580.0154 614.0510 620.4674 637.8287 663.2113 677.1454 696.3186 703.9282 776.0297 785.7269 787.5728 801.0701 806.3159 824.6671 840.5460 846.5151 894.1379 926.7845 939.4148 960.2927 961.7747 976.5401 980.3681 985.7018 994.2316 1002.8185 1017.2940 1037.1873 1047.4270 1049.8179 1065.8222 1097.3189 1121.8693 1123.2018 1156.2518 1180.3016 1187.3338 1195.0521 1219.3216 1240.8512 1249.3494 1287.7547 1298.8464 1349.3053 1378.8579 1379.4514 1391.4574 1400.1750 1411.0846 1414.8079 1436.5614 1440.4605 1447.3080 1469.3460 1471.8842 1474.6959 1482.6666 1513.0858 1547.0790 1576.2509 1590.5623 1592.7945 1619.4068 2161.2502 2950.5769 2983.3807 3046.1619 3063.2246 3093.8005 3105.6825 3133.2226 3136.7327 3138.8804 3145.8567 3150.2575 3161.2128 3162.1463 3164.8716 3170.5142 3177.8927
redmass: 1.2949 2.8608 4.9871 4.3236 6.0557 5.1298 5.5473 4.4454 8.5217 5.1421 6.0951 3.0405 2.4576 4.3530 2.2545 4.9734 7.7434 4.2074 5.2603 5.0471 4.0441 3.9559 4.1954 7.8643 7.1955 2.8752 5.6617 6.1087 4.2501 3.6960 6.1071 5.5297 3.1672 6.1242 6.0232 5.5781 6.9581 2.9577 3.8900 6.7661 5.5230 3.3174 5.0409 2.0456 2.3223 11.9640 3.0282 1.3401 1.4977 1.2718 1.7661 11.2226 5.1039 1.3436 1.4151 1.3910 1.4364 2.3521 2.0917 1.3506 5.2008 2.4430 2.4186 1.5927 1.4097 2.9195 1.2975 1.5129 1.6077 1.0855 1.1336 1.4638 3.0503 1.9766 3.5505 1.9310 1.2637 4.6578 2.2955 4.0322 3.2164 1.2964 8.8634 1.1526 2.2478 1.1189 2.3604 1.0470 2.2900 1.1157 1.0917 3.6916 5.1966 7.0784 6.7098 5.9943 6.1505 12.6338 1.0406 1.0377 1.0941 1.0972 1.0991 1.0972 1.0862 1.0893 1.0890 1.0911 1.0881 1.0958 1.0965 1.0967 1.0959 1.0974
irintensity: 0.8001 1.3326 1.0084 0.1885 2.5854 1.8910 1.7061 1.4768 2.2333 1.4317 4.8632 3.3413 2.6140 5.1535 2.4958 6.6843 9.3920 9.7835 7.5964 2.1448 2.3548 2.6362 1.6715 20.1547 10.7057 0.0412 53.9472 6.9505 5.5920 4.9921 4.6417 3.9355 80.1345 2.2686 17.7965 2.4373 0.4529 3.0335 2.1701 4.4101 0.6126 1.1086 7.9261 48.8214 48.0103 132.7061 2.2628 29.7308 22.0543 2.6984 2.4484 54.3571 3.1315 1.2501 1.4355 1.4940 0.1705 2.4540 5.5517 0.6933 3.9123 3.1322 20.8331 10.9898 21.4061 1.7747 6.7382 7.2297 4.7756 3.0666 13.1760 4.1291 5.8882 9.5702 3.4713 3.6298 2.2363 3.6699 6.5227 6.0842 8.5711 17.3009 7.2899 12.6257 15.4306 38.5233 0.4824 14.2852 18.6844 13.9840 10.4370 17.4820 15.7138 2.1290 5.6773 12.0426 0.8594 66.7758 33.2250 18.8483 13.2383 13.7554 15.8628 1.4408 1.6200 8.0399 6.6158 8.2375 5.1079 2.0629 15.6642 8.8253 6.1015 9.5791
temp: 298.150 k
press: 1.00000 atm
elementType: 16 8 8 7 7 6 6 6 6 6 6 6 6 6 6 6 6 6 6 6 6 6 6 6 1 1 1 1 1 1 1 1 1 1 1 1 1 1 1 1
symmnumber: 1
zpe: 783692.4 jmol-1
zpe.correction: 0.298493 hartree
zpe.thermalcorrener: 0.320495 hartree
zpe.thermalcorrenthalpy: 0.321439 hartree
zpe.thermalcorrgfe: 0.245958 hartree
zpe.sumelectzpe: -1389.783433 hartree
zpe.sumelectthermal: -1389.761431 hartree
zpe.sumelectthermalent: -1389.760487 hartree
zpe.sumelectthermalfe: -1389.835968 hartree
dipole: 0.3447 2.7133 -1.1969
dipole: 2.9855
quadrupole: -187.8383 -135.3253 -132.4769
quadrupole: -12.5682 17.7183 5.6067
quadrupole: -35.9581 16.5548 19.4033 -12.5682 17.7183 5.6067
hfenergy: -1390.0819259 hartree
pointgroup: C01 [X(C19H16N2O2S1)]
dipole: 0.6809114 -0.9558754 -0.0482093 debye
polarizability: 256.7544782|44.6533422|320.8978368|-33.1339707|-16.2895837|250.1121464 unknown
InChI: InChI=1S/C12H9N2.C7H7O2S/c1-14-12-7-6-9(8-13)10-4-2-3-5-11(10)12;1-6-2-4-7(5-3-6)10(8)9/h2-7H,1H3;2-5H,1H3
charge 0 multiplicity 1
40 atoms
S  1.544518 2.558336 -0.717911
O  1.007339 3.501201 0.494566
O  2.651218 3.127913 -1.78252
N  -0.156815 2.008775 -1.92049
N  -2.341965 -4.341574 -0.289288
C  -0.591409 0.70483 -1.610624
C  -1.30988 0.511498 -0.355422
C  -1.770146 -0.811497 0.006702
C  2.231336 0.961599 0.018054
C  -0.425585 -0.398314 -2.484977
C  0.28818 2.304831 -3.29998
C  -1.549719 -1.90862 -0.911719
C  -1.59282 1.605129 0.521024
C  -0.909043 -1.682004 -2.146285
C  3.202075 0.266001 -0.720242
C  1.767694 0.544869 1.277101
C  -2.448927 -0.999649 1.253739
C  3.28517 -1.394555 1.103652
C  -2.268092 1.395617 1.728372
C  3.727283 -0.9198 -0.159201
C  2.30872 -0.642505 1.81247
C  -2.686577 0.083271 2.104732
C  3.840603 -2.677474 1.692835
C  -1.98388 -3.234969 -0.574285
H  0.088893 -0.265976 -3.440925
H  1.053889 1.6193 -3.717593
H  0.705097 3.323638 -3.325323
H  -0.610776 2.27736 -3.944243
H  -1.282347 2.610877 0.226558
H  -0.765441 -2.518341 -2.837405
H  3.557571 0.655496 -1.679664
H  1.02713 1.137237 1.823317
H  -2.790597 -2.004345 1.52614
H  -2.486113 2.246105 2.382696
H  4.492975 -1.478425 -0.708868
H  1.966974 -0.989097 2.794491
H  -3.212541 -0.070524 3.053068
H  3.054104 -3.452026 1.766117
H  4.659337 -3.087766 1.078499
H  4.229866 -2.513726 2.714334
