program: Gaussian 09
title: 000297953
version: EM64L-G09RevD.01
frameworkgroup: C1[X(C18H23N3O)]
method: RPBEPBE
basis: SDD
operation: Freq
keyword: #p
keyword: freq=noraman
keyword: PBEPBE/SDD
title: #p freq=noraman PBEPBE/SDD
converged: YES YES NO NO
title: Mulliken charges:
elementType: O N N N C C C C C C C C C C C C C C C C C C H H H H H H H H H H H H H H H H H H H H H H H
charge: -0.276843 -0.070935 -0.405133 -0.369206 -0.229160 -0.170924 -0.513136 -0.160800 -0.611960 -0.462321 0.492684 -0.202760 0.371685 0.228704 -0.649207 0.194240 -0.507467 -0.444249 -0.373470 -0.204129 -0.335875 -0.656894 0.228769 0.239266 0.261055 0.223711 0.207883 0.222204 0.240386 0.228593 0.207444 0.222389 0.196151 0.223812 0.232164 0.263556 0.300900 0.225554 0.212831 0.293830 0.258168 0.213305 0.201676 0.235084 0.218423
chargesum: 0.00000
title: Mulliken charges with hydrogens summed into heavy atoms:
elementType: O N N N C C C C C C C C C C C C C C C C C C
charge: -0.276843 -0.070935 -0.104233 -0.075376 -0.000391 0.068342 -0.028369 0.047083 -0.149370 -0.026284 0.492684 -0.202760 0.371685 0.228704 -0.006855 0.194240 -0.275303 -0.180693 -0.147916 0.008703 0.135599 -0.001712
polarizability: 2.64662268e+02 8.88063337e+00 2.14771963e+02 -2.37630607e+01 2.72287716e+01 1.68192632e+02
1716.lowfreq: -4.3774 -0.0005 -0.0004 0.0002 1.7724 9.5142 13.8747 26.9684 41.2348
frequency: 13.2569 26.9421 41.2278 59.3791 82.4715 101.8193 138.1544 155.9138 160.1149 194.7457 206.3630 221.8287 231.2192 237.5843 268.6656 281.1685 298.3211 323.8924 336.0112 353.0398 392.3128 416.0689 430.8636 453.1176 471.3114 492.3298 519.0433 532.1655 559.4854 567.8011 578.7648 601.4890 618.8726 636.6939 687.2424 709.2964 725.3728 737.6946 753.7402 778.2181 790.4425 795.9913 807.3944 834.2073 873.4638 877.1485 887.7032 897.5979 917.1443 942.7757 950.9669 966.8205 987.1952 1032.3202 1036.6913 1047.3834 1060.7183 1074.0409 1085.7240 1091.7698 1099.7330 1104.7825 1111.0386 1125.2779 1137.9429 1140.0553 1170.1614 1174.5203 1185.0282 1197.6991 1217.3988 1222.3118 1237.6100 1256.6673 1261.5843 1276.4093 1279.6614 1292.3546 1306.1133 1313.3742 1317.2483 1324.2406 1331.8337 1344.5182 1355.2175 1359.8319 1370.2535 1387.3763 1406.1044 1417.5802 1432.6868 1452.4123 1459.6918 1464.9520 1465.6353 1471.7351 1478.0290 1479.7439 1484.4163 1489.3192 1493.6749 1500.1090 1564.8939 1611.0516 1617.4293 1628.2171 2870.2361 2899.8903 2971.3528 2973.1545 2980.0171 2980.1549 2987.8236 2989.4211 2992.7296 3007.6725 3015.8720 3031.9493 3054.4811 3062.4153 3066.7724 3081.8549 3095.4639 3114.6759 3131.1454 3152.8752 3218.3677 3545.0218 3613.2784
redmass: 3.3424 3.8389 3.8716 5.1363 3.7866 2.9726 3.5527 2.8589 2.6668 2.1370 2.1794 2.6259 1.2616 2.8568 3.8870 2.1875 5.1949 3.3926 3.2045 3.0959 3.9073 3.0615 3.5541 3.7006 3.9931 1.2709 2.6754 3.1894 3.6744 1.2335 3.8743 3.2126 4.1982 2.7931 4.0971 6.2524 3.5757 3.9930 1.4653 1.6641 1.7611 2.5898 2.2374 5.0213 2.6153 1.5359 2.2247 1.7027 2.6356 2.5711 1.3866 2.1507 2.4844 2.2194 2.1848 2.3289 2.7663 2.8590 2.9517 2.0978 2.0133 1.6572 2.6159 2.0411 1.6221 1.7676 1.5045 1.2793 1.7221 1.6785 1.6603 1.4093 2.0177 1.5741 1.3986 1.5327 1.1845 1.9433 1.3531 1.2861 1.6843 1.5906 1.3204 2.2574 1.3318 1.4702 1.5014 1.2202 2.8248 3.2691 1.1593 3.1119 1.1966 1.1425 1.1290 1.0551 1.0915 1.1033 1.0854 1.5942 1.0681 3.3646 6.8461 6.0967 7.3266 7.9937 1.0555 1.0682 1.0737 1.0785 1.0762 1.0364 1.0660 1.0837 1.0605 1.0741 1.0916 1.0984 1.1023 1.0973 1.1004 1.0973 1.1014 1.0866 1.0907 1.0983 1.0981 1.0773 1.0807
irintensity: 2.3539 1.7778 3.9687 2.3073 0.3677 4.0468 4.2424 0.3319 0.7057 8.8897 4.3780 2.1228 2.4382 0.7022 1.1764 1.7106 5.6298 6.8851 6.0816 7.6933 2.4299 0.4933 4.7912 3.1545 3.8922 96.0091 2.9750 6.4023 4.7374 93.5733 3.6602 0.7239 1.7145 3.5280 3.2250 3.7442 4.5779 2.1886 72.3749 44.6860 5.9652 1.5356 1.1156 2.9949 6.5269 0.1787 1.7123 5.6243 2.4386 9.3852 1.0964 1.2196 4.0031 22.1147 11.0365 55.4192 6.3303 22.4476 2.3235 5.5409 9.6579 4.6632 11.5886 11.6605 20.1490 4.3733 22.6450 0.6743 32.0941 75.0533 1.3670 9.9400 3.6816 33.0038 6.9063 3.4812 64.0835 11.2463 3.5850 0.5238 2.9297 38.7970 3.0203 34.3286 2.5392 8.2300 14.2865 18.6796 6.9999 7.6403 7.9769 16.1584 21.3145 78.2648 27.1399 8.1140 4.6448 19.5683 10.8728 175.5756 14.7091 1.1434 1.7733 124.0425 16.2010 8.4416 105.3191 43.0240 8.2874 38.8229 26.4443 35.0475 49.5488 38.4266 20.8220 59.4659 47.7730 36.7799 26.3675 9.9691 38.4686 38.5563 34.9719 7.1719 18.3546 38.5512 1.8112 13.8147 59.5669
temp: 298.150 k
press: 1.00000 atm
elementType: 8 7 7 7 6 6 6 6 6 6 6 6 6 6 6 6 6 6 6 6 6 6 1 1 1 1 1 1 1 1 1 1 1 1 1 1 1 1 1 1 1 1 1 1 1
symmnumber: 1
zpe: 998918.0 jmol-1
zpe.correction: 0.380468 hartree
zpe.thermalcorrener: 0.400407 hartree
zpe.thermalcorrenthalpy: 0.401352 hartree
zpe.thermalcorrgfe: 0.330798 hartree
zpe.sumelectzpe: -937.587288 hartree
zpe.sumelectthermal: -937.567349 hartree
zpe.sumelectthermalent: -937.566405 hartree
zpe.sumelectthermalfe: -937.636958 hartree
dipole: -0.2131 0.0189 -1.6902
dipole: 1.7037
quadrupole: -101.9244 -122.8222 -135.2304
quadrupole: -6.7148 -19.8897 4.5510
quadrupole: 18.0679 -2.8299 -15.2380 -6.7148 -19.8897 4.5510
hfenergy: -937.9677563 hartree
pointgroup: C01 [X(C18H23N3O1)]
dipole: 0.0468882 0.1209207 0.6576138 debye
polarizability: 267.1880958|-9.5417165|203.8790275|-16.5284553|-34.4516803|176.5597396 unknown
InChI: InChI=1S/C18H23N3O/c1-3-19-18(22)12-7-14-13-5-4-6-15-17(13)11(9-20-15)8-16(14)21(2)10-12/h4-6,9,12,14,16,19-20H,3,7-8,10H2,1-2H3
charge 0 multiplicity 1
45 atoms
O  -3.102921 -0.477922 -1.897007
N  -0.847582 2.29467 0.606475
N  4.487724 -0.055844 -1.172044
N  -4.2366 -1.098273 0.043278
C  0.302058 0.138276 1.010402
C  0.471276 1.616685 0.513954
C  -0.803816 -0.58878 0.193693
C  -2.143165 0.195528 0.263359
C  1.164252 1.736701 -0.900254
C  -1.921703 1.661231 -0.187897
C  1.622668 -0.619579 0.95802
C  2.565984 -0.172638 0.007355
C  2.443293 0.936331 -0.901475
C  3.841996 -0.787403 -0.165606
C  -0.797173 3.75894 0.451401
C  -3.193053 -0.475982 -0.628767
C  1.992512 -1.725367 1.748846
C  3.63997 0.990095 -1.612939
C  4.211016 -1.904246 0.620761
C  3.265932 -2.353564 1.572327
C  -5.327865 -1.803471 -0.650122
C  -6.693589 -1.107052 -0.47415
H  -0.049217 0.205465 2.060225
H  1.141486 2.122101 1.239209
H  -0.499389 -0.691882 -0.864947
H  -0.938136 -1.614414 0.587113
H  -2.484727 0.212854 1.319259
H  1.349521 2.803973 -1.124064
H  0.472703 1.364765 -1.682386
H  -1.726509 1.662234 -1.286511
H  -2.849872 2.242726 -0.026555
H  -1.764657 4.196035 0.761056
H  -0.590251 4.106234 -0.590848
H  -0.010807 4.172018 1.109322
H  1.30802 -2.113256 2.513302
H  3.967037 1.672973 -2.395308
H  5.422763 -0.235588 -1.530046
H  5.179386 -2.405546 0.514597
H  3.521698 -3.213299 2.202694
H  -4.263128 -1.037233 1.062809
H  -5.041266 -1.829429 -1.715469
H  -5.380858 -2.848517 -0.286261
H  -6.987874 -1.049965 0.590883
H  -6.659991 -0.081082 -0.879922
H  -7.480242 -1.667603 -1.011767
