program: Gaussian 09
title: 000297921
version: EM64L-G09RevD.01
frameworkgroup: C1[X(C13H18O)]
method: RPBEPBE
basis: SDD
operation: Freq
keyword: #pfreq=noraman
keyword: PBEPBE/SDD
title: #p freq=noraman PBEPBE/SDD
converged: NO YES NO NO
title: Mulliken charges:
elementType: O C C C C C C C C C C C C C H H H H H H H H H H H H H H H H H H
charge: -0.229911 -0.222437 -0.371476 0.547389 -0.353269 -0.720192 -0.469484 -0.401477 -0.691479 -0.342982 -0.376029 0.296108 0.122627 -0.792066 0.203459 0.192980 0.192854 0.188432 0.217720 0.215541 0.228259 0.213327 0.235618 0.234084 0.217694 0.207033 0.211052 0.239294 0.274542 0.236503 0.236813 0.259474
chargesum: 0.00000
title: Mulliken charges with hydrogens summed into heavy atoms:
elementType: O C C C C C C C C C C C C C
charge: -0.229911 -0.018978 0.014357 0.547389 0.052882 -0.063065 -0.233866 -0.167393 -0.055700 -0.103688 -0.101486 0.296108 0.122627 -0.059276
polarizability: 1.97449855e+02 -1.70386174e+01 1.05949067e+02 -2.34144013e+00 -5.52536154e-01 1.33328058e+02
1716.lowfreq: -2.0666 0.0007 0.0008 0.0008 3.2756 10.5608 27.5630 41.3813 70.4308
frequency: 27.0509 41.3469 70.4075 77.4465 99.6504 140.0353 145.1641 158.6562 193.6443 216.9307 227.8490 238.8360 289.2669 305.5533 368.4265 404.7420 411.4525 438.6094 511.7934 532.5352 554.9753 602.5866 632.1804 651.8003 738.7461 757.0854 775.6384 840.8711 862.8326 865.3653 875.5114 928.5037 944.9239 968.1496 989.5482 998.2802 1008.2656 1023.5129 1027.1993 1061.6437 1068.3033 1076.8884 1111.6019 1120.3882 1147.3706 1189.6986 1209.8618 1223.4175 1266.9437 1274.2665 1286.2747 1299.0903 1309.2161 1332.2578 1348.3034 1367.8203 1387.1973 1389.3567 1391.8070 1413.1796 1446.8825 1461.2967 1462.1629 1473.0465 1473.6115 1476.4874 1477.4170 1486.1527 1499.4491 1562.8626 1597.3040 1619.4827 2959.9818 2968.4237 2971.2769 2973.6221 2976.0151 2984.3165 3007.2813 3032.6870 3067.8426 3069.2214 3071.3478 3072.0237 3079.2449 3119.6446 3124.4450 3124.8916 3148.7937 3156.2519
redmass: 3.4651 4.4106 3.7187 1.7182 3.4118 3.0373 1.0910 2.3964 3.1669 1.1982 1.5636 1.5207 3.9009 3.9874 3.2333 2.8857 3.5618 3.2900 3.3757 2.9776 3.7635 2.2120 6.8661 3.0096 1.2773 2.8357 3.6144 1.3774 1.3136 1.5282 1.5378 2.0095 2.1791 1.3739 1.4975 1.3751 3.0449 1.8971 1.8219 2.2791 2.4441 1.9073 1.8978 1.7433 1.9010 1.1303 2.1268 1.4123 1.2701 3.6132 1.1862 1.3020 1.3381 1.7453 1.5471 1.2546 1.4105 1.3182 2.1142 2.9965 1.0944 1.0749 1.0503 1.0593 1.0534 1.0674 1.0519 1.0795 2.4444 6.4631 7.3701 6.6080 1.0597 1.0679 1.0370 1.0754 1.0355 1.0374 1.0974 1.1025 1.1008 1.0970 1.0995 1.0992 1.1001 1.0883 1.0893 1.0980 1.0948 1.0955
irintensity: 1.9062 0.7421 2.8473 0.0507 0.0625 1.0299 0.4838 1.0943 0.5106 0.8281 1.1706 1.1796 1.4150 0.1691 1.0620 0.0715 0.8910 1.0259 1.1394 5.6632 17.9166 20.6857 1.7092 2.6358 8.3490 2.1215 0.0415 30.8155 12.5505 13.4237 4.0631 3.6969 31.9684 0.1550 9.7170 1.9891 7.3170 5.9804 0.9482 3.5672 5.3814 13.2150 5.3296 11.8828 1.8444 28.2642 0.8794 0.5409 3.4679 229.3728 2.6183 6.2474 0.3781 1.0977 2.9980 57.0081 10.8901 7.8876 8.2386 24.1289 27.9726 1.2916 20.5579 0.5402 16.6769 12.0684 6.4313 14.0696 0.2167 73.4885 139.9748 33.4421 8.4005 20.0493 37.6254 49.2704 45.0594 3.8093 7.1364 35.0549 52.1808 12.9522 81.5505 45.0598 34.5534 17.2643 21.1406 7.4369 18.7916 3.1380
temp: 298.150 k
press: 1.00000 atm
elementType: 8 6 6 6 6 6 6 6 6 6 6 6 6 6 1 1 1 1 1 1 1 1 1 1 1 1 1 1 1 1 1 1
symmnumber: 1
zpe: 718738.7 jmol-1
zpe.correction: 0.273753 hartree
zpe.thermalcorrener: 0.289017 hartree
zpe.thermalcorrenthalpy: 0.289961 hartree
zpe.thermalcorrgfe: 0.230339 hartree
zpe.sumelectzpe: -580.352573 hartree
zpe.sumelectthermal: -580.337309 hartree
zpe.sumelectthermalent: -580.336365 hartree
zpe.sumelectthermalfe: -580.395987 hartree
dipole: -2.8139 0.5361 2.8527
dipole: 4.0427
quadrupole: -90.8106 -87.2263 -83.5800
quadrupole: -0.9800 12.0469 -1.6089
quadrupole: -3.6050 -0.0206 3.6256 -0.9800 12.0469 -1.6089
hfenergy: -580.626326 hartree
pointgroup: C01 [X(C13H18O1)]
dipole: 1.1231428 0.2619954 -1.0952891 debye
polarizability: 197.7529258|16.3910102|105.6918358|-0.6161186|-0.7078669|133.2822179 unknown
InChI: InChI=1S/C13H18O/c1-4-5-10(2)12-6-8-13(9-7-12)11(3)14/h6-10H,4-5H2,1-3H3
charge 0 multiplicity 1
32 atoms
O  -3.945908 -0.521954 1.340837
C  2.259456 1.041905 -0.310795
C  3.192846 -0.049017 0.293746
C  0.780811 0.667894 -0.193326
C  3.115225 -1.415801 -0.42273
C  2.538148 2.424723 0.338187
C  -0.02296 0.503894 -1.350229
C  0.167438 0.484173 1.0778
C  4.07672 -2.459406 0.185612
C  -1.390046 0.169689 -1.250766
C  -1.193338 0.150808 1.184508
C  -1.995113 -0.012101 0.020413
C  -3.444922 -0.370005 0.186822
C  -4.306997 -0.550282 -1.060451
H  2.499716 1.12053 -1.391313
H  2.953184 -0.182687 1.368993
H  4.236624 0.325431 0.252645
H  3.351312 -1.276134 -1.49804
H  2.076277 -1.797029 -0.378457
H  3.594501 2.715643 0.18874
H  1.896511 3.210822 -0.098816
H  2.346305 2.398959 1.427032
H  0.432083 0.640178 -2.339024
H  0.764079 0.603979 1.990085
H  4.007447 -3.427999 -0.342689
H  5.127262 -2.116201 0.126919
H  3.842228 -2.639414 1.251918
H  -1.980036 0.050745 -2.165951
H  -1.671525 0.007905 2.159607
H  -3.904651 -1.352255 -1.707195
H  -4.334606 0.378061 -1.661136
H  -5.330771 -0.812554 -0.753843
