program: Gaussian 09
title: 000297924
version: EM64L-G09RevD.01
frameworkgroup: C1[X(C10H15N3O4)]
method: RPBEPBE
basis: SDD
operation: Freq
keyword: #p
keyword: freq=noraman
keyword: PBEPBE/SDD
title: #p freq=noraman PBEPBE/SDD
converged: YES YES NO NO
title: Mulliken charges:
elementType: O O O O N N N C C C C C C C C C C H H H H H H H H H H H H H H H
charge: -0.285095 -0.463059 -0.270426 -0.245573 -0.183524 -0.547687 -0.396894 -0.114527 -0.045599 -0.023329 -0.516589 -0.439847 -0.235582 0.191822 0.243057 0.090327 -0.763872 0.231261 0.225447 0.287541 0.247797 0.277477 0.235451 0.218748 0.356120 0.293649 0.307181 0.262064 0.359175 0.245300 0.248903 0.210284
chargesum: 0.00000
title: Mulliken charges with hydrogens summed into heavy atoms:
elementType: O O O O N N N C C C C C C C C C C
charge: -0.285095 -0.106939 -0.270426 -0.245573 -0.183524 0.021559 -0.037719 0.116734 0.179848 0.264212 0.008685 0.014351 0.058067 0.191822 0.243057 0.090327 -0.059385
polarizability: 1.86050350e+02 -8.56933776e+00 1.44443422e+02 -9.73634328e+00 2.34948436e+00 9.50936331e+01
1716.lowfreq: -17.8995 -7.3334 -0.0001 0.0002 0.0002 7.0558 24.3851 37.3494 50.0292
frequency: 23.8907 37.0228 49.9502 93.3266 112.3245 140.0620 142.6478 158.4406 190.7786 213.8355 233.0445 260.5770 270.8376 284.7416 291.4084 331.1237 343.4769 367.4880 382.2561 411.4003 444.6074 475.4813 516.8275 545.6441 604.3381 618.2125 620.8403 671.7985 699.5130 714.7592 735.1145 742.2791 777.9838 782.3285 829.2079 874.8334 899.4750 916.4954 927.7822 970.1389 993.7151 1025.2090 1038.2313 1049.2577 1051.8152 1056.1070 1085.7306 1109.9912 1130.3885 1136.1931 1182.0258 1208.2490 1222.7960 1236.5305 1260.3858 1262.5943 1291.6172 1316.8314 1324.7228 1332.0684 1336.5501 1351.7742 1356.1936 1370.0321 1390.2814 1404.8554 1414.0749 1449.8948 1453.3611 1467.9730 1472.5520 1613.5614 1628.3419 1632.5865 1658.2953 2974.2411 2986.4189 3004.8320 3022.3016 3034.9831 3066.4222 3068.6304 3077.2289 3095.6903 3115.5792 3183.2402 3480.7178 3523.4975 3577.7215 3613.1793
redmass: 4.7657 4.7369 6.4440 5.3384 1.0605 3.2091 3.1311 4.9420 5.4036 4.6631 3.4157 3.0624 1.1320 3.9924 2.4567 1.9745 2.3932 6.7041 4.3650 3.5470 4.1170 6.1553 6.0639 2.9038 1.5196 4.7110 2.8852 4.6382 2.8234 3.4888 5.7609 6.7399 2.2953 2.1157 3.6330 5.5874 2.2290 1.3308 2.0011 2.1506 2.4735 1.8928 2.5900 2.1966 1.8387 2.4597 2.2492 3.3088 1.5122 5.4346 1.5612 1.3765 3.5813 1.3858 2.2129 1.3294 1.3279 1.3420 1.6410 1.3577 1.2611 1.3580 1.6728 1.7055 1.4730 1.3851 3.2670 1.0437 1.0855 1.0897 1.0803 5.7952 10.5493 1.0887 6.0017 1.0852 1.0363 1.0620 1.0866 1.0633 1.0975 1.1046 1.0889 1.1004 1.1024 1.0923 1.0442 1.0770 1.0665 1.0992
irintensity: 2.3203 0.8915 2.9244 0.4883 0.5159 1.0149 1.1928 2.8351 9.4526 13.7107 4.8192 2.4699 126.8684 0.4512 31.6180 45.1518 39.4107 14.9287 1.2207 5.1495 9.5412 10.3284 4.0592 27.4725 295.2383 5.1940 64.7636 11.3024 12.6123 6.3674 8.7075 9.2637 111.2834 13.9998 4.1754 39.9557 50.1402 25.8453 80.7393 4.9677 61.4898 28.6920 104.4095 59.8500 12.0499 12.3613 7.9002 9.7425 43.2360 19.4323 55.2346 24.0298 7.7189 72.7634 194.7338 7.0016 3.6206 3.6793 33.7286 7.7056 1.9947 1.9233 13.0185 11.6990 2.4816 50.5932 60.8421 11.7219 8.8838 22.2716 3.0234 193.8027 284.8568 42.1793 564.1417 40.6945 22.9537 16.5607 45.2051 9.8496 14.0058 33.4234 11.4039 15.2234 10.1158 7.7395 5.4766 55.6371 14.7409 10.5423
temp: 298.150 k
press: 1.00000 atm
elementType: 8 8 8 8 7 7 7 6 6 6 6 6 6 6 6 6 6 1 1 1 1 1 1 1 1 1 1 1 1 1 1 1
symmnumber: 1
zpe: 668986.2 jmol-1
zpe.correction: 0.254803 hartree
zpe.thermalcorrener: 0.271691 hartree
zpe.thermalcorrenthalpy: 0.272635 hartree
zpe.thermalcorrgfe: 0.209572 hartree
zpe.sumelectzpe: -853.924533 hartree
zpe.sumelectthermal: -853.907645 hartree
zpe.sumelectthermalent: -853.906701 hartree
zpe.sumelectthermalfe: -853.969764 hartree
dipole: 2.8130 1.4930 2.0724
dipole: 3.7996
quadrupole: -132.4992 -97.8864 -97.0938
quadrupole: 0.0521 9.4875 -3.5053
quadrupole: -23.3394 11.2734 12.0660 0.0521 9.4875 -3.5053
hfenergy: -854.1793359 hartree
pointgroup: C01 [X(C10H15N3O4)]
dipole: -1.135444 -0.5297211 0.8153437 debye
polarizability: 185.2428404|-8.0567704|144.0771125|12.940389|-5.6416699|96.267452 unknown
InChI: InChI=1S/C10H15N3O4/c1-5-4-13(10(16)12-9(5)15)8-2-6(14)7(3-11)17-8/h4,6-8,12,14H,2-3,11H2,1H3
charge 0 multiplicity 1
32 atoms
O  -1.428638 -0.521241 -1.144061
O  -3.448828 0.609576 1.688568
O  1.269771 2.604265 -0.431603
O  4.532112 -0.483633 0.898303
N  0.689401 0.329224 -0.33489
N  -4.991159 -1.209108 0.031621
N  2.870751 1.016993 0.230814
C  -2.196822 0.24164 1.019313
C  -2.49369 -0.78909 -0.10698
C  -0.700572 0.694213 -0.821535
C  -1.526884 1.413051 0.260503
C  -3.892927 -0.657699 -0.767593
C  1.072701 -0.993995 -0.111788
C  1.593375 1.403337 -0.195826
C  2.334772 -1.355246 0.304165
C  3.339923 -0.302897 0.513517
C  2.750196 -2.785465 0.543804
H  -1.490227 -0.193187 1.756343
H  -2.342853 -1.830986 0.232077
H  -0.567535 1.294727 -1.734941
H  -2.30908 2.021244 -0.227785
H  -0.910424 2.071583 0.890396
H  -3.844887 -1.177934 -1.741597
H  -4.098342 0.407144 -0.98057
H  -3.255303 1.266274 2.402831
H  0.292547 -1.728223 -0.324148
H  -5.09339 -0.755367 0.943001
H  -5.039907 -2.229722 0.068384
H  3.549595 1.776806 0.344878
H  3.093628 -2.925483 1.584944
H  3.604315 -3.058332 -0.102304
H  1.91958 -3.484369 0.345959
