program: Gaussian 09
title: 000297960
version: EM64L-G09RevD.01
frameworkgroup: C1[X(C15H14Cl2N2O4S2)]
method: RPBEPBE
basis: SDD
operation: Freq
keyword: #p
keyword: freq=noraman
keyword: PBEPBE/SDD
title: #p freq=noraman PBEPBE/SDD
converged: NO YES NO NO
title: Mulliken charges:
elementType: Cl Cl S S O O O O N N C C C C C C C C C C C C C C C H H H H H H H H H H H H H H
charge: -0.026628 -0.023536 0.943984 0.922333 -0.501546 -0.506736 -0.501257 -0.551875 -0.211421 -0.267999 -0.425947 -0.454030 -0.397748 -0.101963 -0.007398 -0.241194 -0.237165 -0.232008 -0.216688 -0.191188 -0.183874 -0.200516 -0.182890 -0.111904 -0.102585 0.334065 0.292697 0.270934 0.269777 0.261085 0.271547 0.302753 0.289752 0.345320 0.286366 0.270982 0.269931 0.275779 0.270793
chargesum: 0.00000
title: Mulliken charges with hydrogens summed into heavy atoms:
elementType: Cl Cl S S O O O O N N C C C C C C C C C C C C C C C
charge: -0.026628 -0.023536 0.943984 0.922333 -0.501546 -0.506736 -0.501257 -0.551875 -0.211421 -0.267999 0.200815 0.086681 0.134883 -0.101963 -0.007398 0.061559 0.052587 0.113313 0.069678 0.079793 0.086057 0.075263 0.087903 -0.111904 -0.102585
polarizability: 3.68822216e+02 7.02029004e+00 2.77352777e+02 4.84797839e+00 -1.14294856e-01 1.65319604e+02
1716.lowfreq: -9.9339 -0.0012 0.0015 0.0020 3.4379 4.6482 17.0449 24.9162 29.3069
frequency: 17.0000 24.7774 29.2504 36.2587 44.1027 60.0536 65.0971 93.2448 108.4373 120.5547 126.3915 134.9911 169.7315 196.7932 205.9153 214.8257 225.4745 242.1077 250.7087 253.2318 265.3042 274.9695 295.9702 308.1041 327.0990 334.0867 381.1263 391.0310 395.9301 398.9212 409.1563 411.4556 415.3077 419.0974 492.5841 498.2990 510.8408 517.8495 610.7738 611.8568 666.8498 696.9081 697.4572 704.5567 706.4079 736.3043 789.0004 790.6990 809.4361 827.9430 832.5469 834.8980 840.3148 847.8490 867.6752 921.8138 942.4251 950.0881 958.4043 966.2422 969.1348 972.3465 977.7014 983.4001 989.3720 1013.0664 1041.8940 1049.7540 1065.2935 1067.4338 1067.7062 1072.2490 1105.2024 1114.2419 1175.3326 1184.3549 1187.6419 1195.1588 1232.2492 1282.0433 1293.5896 1296.0609 1301.3874 1320.8440 1379.4312 1379.9455 1382.1372 1382.7017 1431.9875 1450.5600 1453.5056 1455.2445 1475.3169 1563.4474 1569.1987 1588.3886 1594.8445 2951.0152 2966.1681 3008.3451 3027.4198 3067.8000 3082.1167 3111.5528 3154.9859 3160.0239 3162.7005 3175.8967 3178.6845 3180.3700 3183.1188
redmass: 10.4467 9.1966 6.9214 5.9251 7.5229 6.4112 5.6581 5.1048 8.2582 6.3575 7.0394 7.4145 10.1079 6.3099 12.2323 11.7790 6.9345 6.0832 9.7372 6.7187 6.1120 6.9301 4.8941 6.8286 4.6156 3.0236 5.6369 7.1014 6.9507 6.3769 2.9150 8.4286 3.3231 8.8205 6.4343 3.9560 4.8209 7.1268 7.1119 7.1304 2.6905 5.8857 5.0359 4.8738 5.2458 7.1760 6.7258 5.7686 12.5548 1.2944 1.4557 1.3642 1.7413 1.3277 5.4701 7.4984 4.2189 12.0660 1.3371 2.1412 1.4249 1.3733 5.6729 6.6079 1.4317 3.5804 3.0786 2.6386 2.3724 3.1767 2.4556 3.5854 1.3186 1.3546 1.1274 1.1269 1.1555 1.1205 1.1632 1.2322 1.2496 1.1792 1.2010 1.2907 8.3480 3.1233 9.3025 2.9390 1.0617 2.1368 1.3394 1.4668 1.0737 5.8306 6.1835 7.8811 8.2125 1.0628 1.0669 1.0640 1.0988 1.0958 1.1021 1.0947 1.0899 1.0896 1.0896 1.0943 1.0966 1.0964 1.0977
irintensity: 0.1902 0.9269 0.3006 0.3023 1.7707 0.7803 1.0067 2.6425 1.4551 2.5092 3.8779 3.7309 1.6640 2.4960 1.0120 15.2571 4.4102 6.2002 0.6905 0.7603 7.3951 6.6981 5.9019 1.9836 3.9819 14.1575 9.9703 17.3516 5.4157 23.6332 0.3028 50.2938 10.1580 74.4457 14.9636 16.8246 99.3780 115.8688 0.6996 0.6665 35.0076 22.1802 15.0351 23.6577 30.8456 5.4704 119.2946 89.9350 114.3979 11.7095 4.8186 60.1570 21.3920 43.2282 39.2387 43.9910 22.3038 91.5411 0.0235 2.8739 5.3019 0.3634 29.8166 48.5661 6.2954 16.0064 35.2888 31.8315 45.6946 59.7618 24.8204 9.6164 6.1552 4.1372 15.4168 6.0415 8.4426 12.9172 28.0195 2.0445 2.1153 0.6082 17.9161 0.0869 10.0316 14.7678 2.2770 20.6124 42.0609 66.8965 22.6249 39.6128 8.2227 41.4582 29.5946 4.7271 1.6490 5.1608 10.5783 19.4944 3.6289 13.6616 4.3289 98.5992 4.6074 2.6879 1.2784 0.7366 4.0591 0.2537 3.7068
temp: 298.150 k
press: 1.00000 atm
elementType: 17 17 16 16 8 8 8 8 7 7 6 6 6 6 6 6 6 6 6 6 6 6 6 6 6 1 1 1 1 1 1 1 1 1 1 1 1 1 1
symmnumber: 1
zpe: 698325.4 jmol-1
zpe.correction: 0.265978 hartree
zpe.thermalcorrener: 0.290965 hartree
zpe.thermalcorrenthalpy: 0.291910 hartree
zpe.thermalcorrgfe: 0.208245 hartree
zpe.sumelectzpe: -2704.439901 hartree
zpe.sumelectthermal: -2704.414914 hartree
zpe.sumelectthermalent: -2704.413970 hartree
zpe.sumelectthermalfe: -2704.497634 hartree
dipole: -2.9888 4.1588 5.6154
dipole: 7.6000
quadrupole: -170.7438 -186.9891 -181.2394
quadrupole: 14.4424 6.2054 -7.1123
quadrupole: 8.9136 -7.3317 -1.5819 14.4424 6.2054 -7.1123
hfenergy: -2704.7058792 hartree
pointgroup: C01 [X(C15H14Cl2N2O4S2)]
dipole: -1.5213927 -1.2089241 -2.2725451 debye
polarizability: 363.7150588|-18.0558441|279.6310585|-17.7793593|13.9685314|168.1484789 unknown
InChI: InChI=1S/C15H14Cl2N2O4S2/c16-12-1-5-14(6-2-12)24(20,21)18-9-10-19(11-18)25(22,23)15-7-3-13(17)4-8-15/h1-8H,9-11H2
charge 0 multiplicity 1
39 atoms
Cl 4.500374 -4.633149 -0.640552
Cl -7.570325 -0.622216 -0.072387
S  2.834873 1.533708 0.35344
S  -1.337552 0.589759 1.056596
O  2.088184 1.652496 1.799849
O  4.177741 2.378079 0.026196
O  -1.25445 1.732988 2.208503
O  -0.617873 -0.879453 1.211749
N  1.509993 2.161344 -0.981174
N  -0.801071 1.471164 -0.61248
C  0.235862 2.537904 -0.331696
C  1.153788 1.143594 -2.017483
C  -0.170746 0.46914 -1.549386
C  3.262855 -0.284439 0.021852
C  -3.150103 0.241673 0.701953
C  4.44885 -0.534898 -0.692031
C  -3.514382 -1.061038 0.325993
C  2.439882 -1.290918 0.555975
C  -4.06869 1.291472 0.867891
C  4.829536 -1.879611 -0.895804
C  -4.881545 -1.326213 0.086729
C  2.828785 -2.634637 0.347475
C  -5.434303 1.022401 0.628108
C  4.008946 -2.903582 -0.376498
C  -5.813981 -0.279014 0.236118
H  0.354547 2.71667 0.759147
H  -0.120316 3.469404 -0.810858
H  1.976349 0.42578 -2.173699
H  1.002836 1.695768 -2.963393
H  -0.857728 0.278283 -2.390115
H  0.024216 -0.486529 -1.020315
H  5.067199 0.296028 -1.047008
H  -2.75888 -1.849016 0.248759
H  1.526892 -1.058006 1.118636
H  -3.736722 2.281896 1.193338
H  5.746326 -2.123003 -1.439568
H  -5.212151 -2.327071 -0.203261
H  2.221852 -3.450632 0.749057
H  -6.18527 1.807971 0.74704
