program: Gaussian 09
title: 000297956
version: EM64L-G09RevD.01
frameworkgroup: C1[X(C20H29N3O)]
method: RPBEPBE
basis: SDD
operation: Freq
keyword: #p
keyword: freq=noraman
keyword: PBEPBE/SDD
title: #p freq=noraman PBEPBE/SDD
converged: YES YES NO NO
title: Mulliken charges:
elementType: O N N N C C C C C C C C C C C C C C C C C C C C H H H H H H H H H H H H H H H H H H H H H H H H H H H H H
charge: -0.276027 -0.113267 -0.398044 -0.368064 -0.072086 -0.198100 -0.130013 -0.572227 -0.524585 0.366313 -0.035743 -0.179812 -0.439229 -0.472389 0.254464 -0.477024 -0.641435 0.186573 -0.415454 -0.210736 -0.388488 -0.331907 -0.352664 -0.686071 0.210830 0.214995 0.274675 0.221219 0.211328 0.236770 0.221123 0.240490 0.213964 0.212652 0.205591 0.223943 0.275153 0.227119 0.222550 0.194833 0.230197 0.225409 0.213154 0.302710 0.206124 0.256929 0.214836 0.192364 0.192421 0.195051 0.213441 0.216515 0.209630
chargesum: 0.00000
title: Mulliken charges with hydrogens summed into heavy atoms:
elementType: O N N N C C C C C C C C C C C C C C C C C C C C
charge: -0.276027 -0.113267 -0.122891 -0.065354 0.138744 0.016894 0.144661 -0.139680 -0.066692 0.366313 -0.035743 0.060678 -0.012613 -0.042856 0.254464 -0.249905 0.006144 0.186573 -0.190045 0.002418 0.074565 0.075292 0.034808 -0.046484
polarizability: 2.74220149e+02 -8.31628011e+00 2.50806955e+02 -1.86536796e+01 -6.43210549e+00 1.73544379e+02
1716.lowfreq: -12.0169 -7.5144 -3.5935 -0.0006 0.0003 0.0006 11.6676 15.1593 31.2495
frequency: -9.6697 15.0347 31.1438 40.4836 60.4218 71.5335 94.2733 106.6916 116.1312 162.0838 170.5355 187.3416 202.7264 207.7516 223.7812 227.1208 242.6433 253.2139 286.2813 292.5454 318.9833 352.8112 377.2900 385.5398 393.8784 418.4179 439.6731 454.4926 479.2632 493.5455 504.3866 526.0014 534.7145 549.2058 567.0345 583.4345 610.7018 652.2599 670.7698 689.8671 710.8537 724.4860 735.1561 745.6228 781.2273 793.1968 820.2985 838.3440 843.6524 852.4884 859.7645 903.7915 913.2942 915.6402 945.5034 948.5545 956.8674 972.2055 981.9300 989.4516 995.4441 1018.7120 1032.9019 1042.5860 1045.8318 1064.1035 1066.1941 1081.1924 1098.2524 1105.2211 1115.1436 1117.5561 1128.4127 1133.2370 1141.0771 1158.4302 1169.6976 1178.9421 1187.2536 1193.4369 1202.1061 1202.9161 1226.2639 1237.0541 1246.8940 1255.4915 1260.0782 1265.0200 1269.0065 1282.8288 1287.1337 1290.5900 1306.0864 1308.2619 1314.5708 1330.1580 1333.6241 1335.2269 1349.2645 1351.6063 1354.2887 1362.4745 1372.6663 1378.6602 1390.7001 1425.4113 1433.2639 1454.3008 1456.7678 1457.6727 1460.1357 1471.9812 1472.7911 1475.6581 1477.4544 1479.7747 1483.9155 1485.9761 1486.5277 1489.4151 1494.6745 1610.6450 1611.2972 1635.6156 2815.8557 2858.6858 2877.7820 2910.4288 2942.7337 2957.9392 2969.5836 2974.1714 2976.1986 2982.9745 2992.7467 2995.1980 2999.3805 3003.0697 3021.1925 3030.2284 3042.0617 3047.5458 3053.7494 3055.7013 3070.4648 3072.0264 3074.4449 3084.1181 3116.4277 3135.8511 3152.0030 3552.0584 3561.9517
redmass: 3.6192 4.8103 4.2806 3.8184 3.7705 1.7634 3.9760 3.5392 2.7370 3.2977 2.8616 1.4397 2.3150 3.7046 3.1806 1.3467 3.2033 3.5256 2.6334 3.3726 2.8028 2.5668 3.0846 2.9283 2.8805 2.5661 2.5041 1.6063 4.1423 2.6473 4.1483 2.9115 3.0293 3.3744 1.2334 3.5402 4.1322 4.0787 3.7259 4.1472 4.4299 2.4017 1.4893 1.5515 2.8233 3.9050 2.1755 2.0443 2.0988 1.7452 2.0246 1.6087 1.7817 2.2308 2.8035 1.3360 1.8322 1.8154 2.2925 3.2779 2.4539 1.8696 2.5124 2.6128 2.7077 2.4675 2.1088 2.2833 2.4588 1.4340 2.4446 2.0092 2.0177 1.8948 2.0152 1.1825 1.3109 1.6284 1.6143 1.6167 1.6520 1.7907 1.3313 1.4596 1.4886 1.3632 1.4094 1.5950 1.8330 1.3331 1.1054 1.6560 1.2932 1.3400 1.5369 1.4057 1.4272 1.5403 1.5048 1.5015 1.5340 1.3621 2.3237 1.5410 1.2114 2.4973 1.1784 1.1254 2.5978 1.0940 1.0839 1.1187 1.0815 1.1709 1.0434 1.7580 1.5124 1.1263 1.2010 1.0999 1.3745 6.6477 6.0655 8.9587 1.0810 1.0582 1.0678 1.0704 1.0814 1.0589 1.0800 1.0411 1.0556 1.0661 1.0764 1.0624 1.0670 1.0989 1.0909 1.0729 1.1011 1.0997 1.1019 1.0942 1.0992 1.0995 1.0995 1.0997 1.0850 1.0911 1.0981 1.0774 1.0780
irintensity: 0.2173 2.0363 3.5985 1.4111 0.7418 0.1324 0.9968 2.1040 4.1848 2.2599 4.2205 1.6176 4.6840 4.3880 3.7883 0.4438 4.2203 2.6324 1.4940 3.4471 5.3803 0.2494 6.9235 2.4721 2.8840 3.6587 40.8582 136.2681 6.2757 1.4055 3.9360 2.0241 7.2901 0.8324 94.6936 1.5605 5.8655 7.1538 8.7412 5.4783 2.7528 5.8848 58.1714 3.0812 27.9731 1.2229 1.2033 10.7455 1.9415 5.1931 0.4381 12.7311 1.4601 3.3424 11.0200 0.8540 10.3981 4.0962 9.6091 1.0404 16.1540 9.4236 17.3217 9.5225 7.8115 18.9147 9.5361 4.5241 9.2658 1.5867 15.2008 3.9334 5.8704 9.5163 6.4526 7.6025 2.1109 9.6475 5.5205 54.8145 15.4329 3.7010 15.3854 9.3385 19.1857 23.5665 18.4221 46.5911 6.5396 14.6445 0.1247 1.6407 15.1590 0.7755 6.8114 25.7335 5.0202 31.3777 0.3308 9.1436 19.6704 4.4930 16.8168 15.5111 10.4044 4.5824 5.1669 42.4048 73.9402 8.3378 11.0092 15.2439 11.5084 5.0023 8.0405 8.0618 175.7625 9.7666 71.9420 6.2021 32.8558 58.7807 131.5715 63.6855 74.4618 104.0126 110.8068 105.4460 25.5075 27.0051 5.5234 18.6952 67.9331 45.9590 11.8534 54.5446 41.0597 6.1872 32.3267 34.8054 55.6561 28.7974 27.6896 73.4446 51.9176 32.6982 51.3012 35.7922 4.8120 27.4167 31.6148 11.2882 16.1182
temp: 298.150 k
press: 1.00000 atm
elementType: 8 7 7 7 6 6 6 6 6 6 6 6 6 6 6 6 6 6 6 6 6 6 6 6 1 1 1 1 1 1 1 1 1 1 1 1 1 1 1 1 1 1 1 1 1 1 1 1 1 1 1 1 1
symmnumber: 1
zpe: 1205254.3 jmol-1
zpe.correction: 0.459057 hartree
zpe.thermalcorrener: 0.481028 hartree
zpe.thermalcorrenthalpy: 0.481972 hartree
zpe.thermalcorrgfe: 0.407385 hartree
zpe.sumelectzpe: -1017.192243 hartree
zpe.sumelectthermal: -1017.170272 hartree
zpe.sumelectthermalent: -1017.169328 hartree
zpe.sumelectthermalfe: -1017.243915 hartree
dipole: 2.1061 1.7541 -1.3894
dipole: 3.0729
quadrupole: -124.5789 -147.1267 -145.6343
quadrupole: -10.4937 5.9329 2.7671
quadrupole: 14.5344 -8.0134 -6.5210 -10.4937 5.9329 2.7671
hfenergy: -1017.6513002 hartree
pointgroup: C01 [X(C20H29N3O1)]
dipole: -0.8943258 -0.6143467 -0.5332668 debye
polarizability: 272.9876839|-10.1621969|252.5338057|17.9695184|4.5391757|173.049993 unknown
InChI: InChI=1S/C20H29N3O/c1-3-4-8-21-20(24)14-9-16-15-6-5-7-17-19(15)13(11-22-17)10-18(16)23(2)12-14/h5-7,13-14,16,18,21-22H,3-4,8-12H2,1-2H3
charge 0 multiplicity 1
53 atoms
O  3.25869 2.25386 0.730595
N  -1.017591 2.315535 -0.342142
N  -4.455673 -1.449381 -0.884084
N  3.371818 0.428131 -0.715282
C  -1.589125 1.882953 0.970855
C  -0.869196 0.601378 1.517776
C  -3.360104 0.562355 -0.230861
C  -3.126292 1.637178 0.845801
C  0.667635 0.776396 1.503493
C  -1.353737 -0.69386 0.847623
C  -2.543011 -0.663104 0.117521
C  1.155944 1.155109 0.086022
C  0.459218 2.470405 -0.324243
C  -4.775485 -0.0522 -0.444665
C  -3.212375 -1.828036 -0.33108
C  -0.754146 -1.973774 1.047724
C  -1.6473 3.545612 -0.871326
C  2.676047 1.336676 0.069115
C  -2.616362 -3.095865 -0.156227
C  -1.370649 -3.137273 0.528593
C  4.841156 0.427553 -0.820171
C  5.51405 -0.729846 -0.044788
C  5.145043 -2.137255 -0.567272
C  5.87786 -3.264069 0.192753
H  -1.428714 2.69061 1.7352
H  -1.172834 0.52953 2.585465
H  -2.991758 0.957089 -1.200295
H  -3.657944 2.579648 0.621309
H  -3.500333 1.280966 1.826153
H  0.964202 1.585716 2.198606
H  1.163969 -0.146308 1.855035
H  0.849278 0.361847 -0.624136
H  0.796021 3.272434 0.379213
H  0.778756 2.767933 -1.340925
H  -5.351938 -0.053445 0.509438
H  -5.363073 0.478536 -1.213094
H  -5.207779 -2.130011 -0.994786
H  0.173543 -2.072037 1.62271
H  -1.142449 3.831931 -1.810839
H  -1.576814 4.41212 -0.165892
H  -2.712249 3.379476 -1.104855
H  -3.094306 -4.018653 -0.502797
H  -0.891106 -4.110668 0.688744
H  2.84013 -0.290764 -1.208552
H  5.125873 0.379263 -1.890364
H  5.176185 1.398767 -0.416057
H  5.247876 -0.645088 1.027033
H  6.613038 -0.593741 -0.112693
H  5.38663 -2.201362 -1.648763
H  4.050247 -2.292528 -0.476954
H  5.634551 -3.235576 1.271436
H  5.597171 -4.261645 -0.1918
H  6.974806 -3.159316 0.094429
