program: Gaussian 09
title: 000297976
version: EM64L-G09RevD.01
frameworkgroup: C1[X(C19H17NO4S)]
method: RPBEPBE
basis: SDD
operation: Freq
keyword: #p
keyword: freq=noraman
keyword: PBEPBE/SDD
title: #p freq=noraman PBEPBE/SDD
converged: YES YES NO NO
title: Mulliken charges:
elementType: S O O O O N C C C C C C C C C C C C C C C C C C C H H H H H H H H H H H H H H H H H
charge: 0.916549 -0.515077 -0.506174 -0.448946 -0.268033 -0.248451 0.118099 0.263031 0.272023 -0.084326 -0.328647 0.088008 -0.671080 -0.372366 -0.384393 -0.398737 -0.207894 -0.252559 -0.266180 -0.248632 0.455999 -0.344408 -0.397001 0.108814 -0.799107 0.240086 0.277043 0.216917 0.251332 0.282081 0.313394 0.306497 0.293025 0.281370 0.241856 0.232913 0.245533 0.244621 0.228292 0.242044 0.237750 0.384730
chargesum: 0.00000
title: Mulliken charges with hydrogens summed into heavy atoms:
elementType: S O O O O N C C C C C C C C C C C C C C C C C C C
charge: 0.916549 -0.515077 -0.506174 -0.064215 -0.268033 -0.248451 0.118099 0.263031 0.272023 -0.084326 -0.088561 0.088008 0.074213 -0.090285 -0.070999 -0.092239 0.085131 0.028812 -0.024323 -0.015719 0.455999 -0.098876 -0.152380 0.108814 -0.091021
polarizability: 3.41785885e+02 -3.21883234e+01 2.32503499e+02 -1.25498343e+01 -6.83773772e+00 2.67330015e+02
1716.lowfreq: -25.7058 -7.7792 -5.6055 -2.5052 -0.0018 -0.0018 -0.0011 13.1955 19.6903
frequency: -25.4847 11.9669 19.5076 38.0079 48.9822 51.7466 60.0174 93.0851 120.4099 127.4042 144.6992 148.9719 167.1611 188.7287 193.8342 212.9336 215.2249 221.2790 268.9996 284.0819 297.3585 331.9582 342.5317 353.1918 380.1339 385.4051 406.9922 407.5854 419.8179 444.9816 467.2691 476.3824 504.3069 546.0380 551.4452 571.0226 580.3562 596.6474 609.4945 620.7488 662.4300 686.3224 700.4620 703.9415 717.7846 776.1310 784.6767 792.0092 802.1034 802.7080 823.5292 843.8272 849.8428 901.5909 911.8504 928.5506 960.0595 966.3704 979.1294 983.3851 985.2499 990.0398 993.6802 1011.6009 1038.3192 1047.7165 1049.7108 1062.2052 1065.7124 1100.2643 1121.5223 1126.7286 1157.0985 1182.6579 1185.5965 1187.0622 1208.6285 1218.5091 1252.7679 1285.4394 1297.9646 1309.4951 1354.7718 1379.7672 1386.6757 1391.3611 1400.5363 1401.1627 1414.9351 1439.2352 1442.2439 1446.3155 1468.7817 1471.2845 1474.8605 1485.7720 1517.3922 1545.0223 1574.9409 1590.4047 1592.8929 1616.1247 1625.1323 2952.5426 2983.3710 3047.0993 3062.5840 3094.3675 3105.5909 3133.6330 3136.8845 3138.5612 3153.5688 3158.4254 3161.9476 3165.2952 3175.3431 3183.5623 3185.8278 3531.6631
redmass: 1.0281 4.9722 6.0137 6.8910 5.4481 6.0919 5.2896 5.0326 4.7442 4.8870 5.3200 4.1007 3.6200 2.5928 2.6789 4.0103 4.5142 7.5505 4.1077 5.3955 4.6951 5.1345 5.8147 3.9934 4.2209 6.8835 2.9365 6.0572 5.4907 4.2768 4.4150 4.1278 3.1390 2.2780 3.9301 5.2074 5.7441 4.7003 1.8254 6.9547 3.2257 5.2328 5.3679 3.3830 4.3721 5.0104 5.0429 1.4359 4.5141 8.2240 1.3438 1.2591 1.5867 1.5886 6.6528 9.3019 1.3056 6.0634 1.4416 1.4299 2.2348 1.4344 2.0583 1.3227 2.5656 2.4211 1.5892 2.7169 1.4041 2.7123 1.2936 1.5334 1.6583 1.1161 1.6787 1.1516 1.5312 3.0761 2.7879 1.9604 1.2611 2.2044 4.0648 4.3284 2.4389 3.1929 1.3261 8.0256 1.1442 1.5706 1.3935 2.3613 1.0501 2.3326 1.1053 1.0869 3.8045 5.2629 7.0708 6.8512 5.9311 5.7794 8.0045 1.0402 1.0376 1.0947 1.0973 1.0990 1.0972 1.0871 1.0892 1.0892 1.0926 1.0880 1.0955 1.0967 1.0958 1.0949 1.0955 1.0641
irintensity: 0.3655 1.2649 0.4779 0.5183 0.1311 1.0138 1.7251 0.2034 0.7668 1.1982 3.3255 6.0474 2.4198 4.7221 2.8735 0.3178 12.1047 10.9819 3.7052 6.0353 3.3065 2.0630 1.0543 15.1960 9.5956 4.8612 1.4177 18.1593 67.3334 5.9629 8.9421 2.5041 85.6355 35.3796 26.6140 20.3139 10.6681 26.7533 99.6214 0.5136 2.9654 21.8328 0.1002 1.1248 11.7006 6.7969 2.8047 104.1660 64.7758 86.4325 27.4838 0.5863 14.3046 5.9797 38.5084 59.9851 0.2580 106.6545 0.1231 2.4530 2.8120 2.2222 6.7171 1.9423 6.0268 19.6945 9.7887 398.2224 28.1439 17.8697 6.9467 11.2717 38.0848 8.9783 24.5286 12.6721 14.2770 5.3761 0.5990 37.4456 2.3090 89.9725 3.7270 3.9219 8.5434 8.6448 16.8030 8.0101 11.4113 44.9843 22.1294 6.7207 14.2427 18.0923 14.1178 12.1044 64.0778 70.4276 15.5593 3.2929 14.4030 84.7363 249.9838 32.7980 20.3782 13.2138 13.7156 16.2811 1.4340 10.8501 9.4233 6.1157 16.6889 5.2236 1.4333 9.9542 5.0324 2.2868 12.0110 70.4016
temp: 298.150 k
press: 1.00000 atm
elementType: 16 8 8 8 8 7 6 6 6 6 6 6 6 6 6 6 6 6 6 6 6 6 6 6 6 1 1 1 1 1 1 1 1 1 1 1 1 1 1 1 1 1
symmnumber: 1
zpe: 823959.4 jmol-1
zpe.correction: 0.313830 hartree
zpe.thermalcorrener: 0.336919 hartree
zpe.thermalcorrenthalpy: 0.337863 hartree
zpe.thermalcorrgfe: 0.259355 hartree
zpe.sumelectzpe: -1486.007589 hartree
zpe.sumelectthermal: -1485.984500 hartree
zpe.sumelectthermalent: -1485.983556 hartree
zpe.sumelectthermalfe: -1486.062064 hartree
dipole: -2.9084 3.8187 -2.3706
dipole: 5.3536
quadrupole: -177.4324 -138.5245 -138.0748
quadrupole: 3.8683 -1.0089 2.4434
quadrupole: -26.0885 12.8194 13.2691 3.8683 -1.0089 2.4434
hfenergy: -1486.3214188 hartree
pointgroup: C01 [X(C19H17N1O4S1)]
dipole: -0.2500662 -2.0688258 -0.3061366 debye
polarizability: 272.9239591|-52.9711729|308.9433325|29.7180342|-4.3958314|259.7521077 unknown
InChI: InChI=1S/C12H10NO2.C7H7O2S/c1-13-11-7-6-10(12(14)15)8-4-2-3-5-9(8)11;1-6-2-4-7(5-3-6)10(8)9/h2-7,14H,1H3;2-5H,1H3
charge 0 multiplicity 1
42 atoms
S  -1.82572 2.482579 -0.484942
O  -3.016693 2.916178 -1.522031
O  -1.401897 3.475052 0.732364
O  2.34303 -3.716787 -1.831723
O  3.035259 -3.303491 0.331427
N  -0.09648 2.200568 -1.724472
C  0.518805 0.956212 -1.483241
C  1.265652 0.791433 -0.241318
C  1.910143 -0.475962 0.057976
C  -2.292473 0.802981 0.23951
C  0.510355 -0.103401 -2.422238
C  1.844803 -1.541494 -0.928546
C  -0.591795 2.501999 -3.085593
C  1.174698 -1.316645 -2.149549
C  1.39036 1.879571 0.677686
C  2.60583 -0.603629 1.308088
C  -1.750028 0.427652 1.480098
C  -3.19874 0.010129 -0.482415
C  2.086094 1.72506 1.880361
C  2.681842 0.470008 2.201151
C  -3.050573 -1.66447 1.324608
C  -2.141841 -0.816879 2.015129
C  -3.57432 -1.231355 0.078122
C  2.459828 -2.874285 -0.703397
C  -3.451836 -3.001643 1.918369
H  -0.018303 0.007034 -3.373249
H  -1.140223 3.456449 -3.058993
H  -1.263815 1.741679 -3.533235
H  0.296594 2.625091 -3.733206
H  1.151374 -2.123181 -2.886241
H  0.943784 2.842168 0.416416
H  3.081319 -1.557267 1.544868
H  -1.061912 1.090118 2.014078
H  -3.621947 0.366142 -1.427151
H  2.183453 2.572796 2.566787
H  3.224137 0.350054 3.145711
H  -1.735036 -1.132734 2.982578
H  -4.288203 -1.866278 -0.458432
H  -4.218287 -3.506226 1.306815
H  -2.580512 -3.678812 1.994914
H  -3.85715 -2.879613 2.939666
H  2.771729 -4.5851 -1.605351
