program: Gaussian 09
title: 000297954
version: EM64L-G09RevD.01
frameworkgroup: C1[X(C19H25N3O)]
method: RPBEPBE
basis: SDD
operation: Freq
keyword: #p
keyword: freq=noraman
keyword: PBEPBE/SDD
title: #p freq=noraman PBEPBE/SDD
converged: YES YES NO NO
title: Mulliken charges:
elementType: O N N N C C C C C C C C C C C C C C C C C C C H H H H H H H H H H H H H H H H H H H H H H H H H
charge: -0.282852 -0.194571 -0.399886 -0.366563 -0.157821 -0.135401 -0.520296 0.015806 0.329696 0.190048 -0.465831 -0.479677 -0.241634 0.255619 -0.405056 -0.433206 -0.637690 -0.415554 0.174278 -0.198704 -0.021965 -0.713550 -0.676572 0.246489 0.204496 0.208075 0.227399 0.212361 0.226807 0.234532 0.217478 0.237216 0.243595 0.279304 0.224589 0.229636 0.202533 0.232069 0.228996 0.217357 0.365019 0.239836 0.218093 0.201447 0.230242 0.253347 0.205390 0.195080
chargesum: 0.00000
title: Mulliken charges with hydrogens summed into heavy atoms:
elementType: O N N N C C C C C C C C C C C C C C C C C C C
charge: -0.282852 -0.194571 -0.120583 -0.001544 0.088668 0.069095 -0.084822 0.015806 0.329696 0.190048 -0.026663 -0.027667 -0.004418 0.255619 -0.161461 -0.208616 0.026548 -0.186559 0.174278 0.018652 0.217871 -0.063768 -0.022755
polarizability: 2.89188508e+02 -9.00696479e+00 2.34656166e+02 2.64302574e+01 -4.37093701e+00 1.71007789e+02
1716.lowfreq: -12.7689 -7.9198 -0.0006 0.0002 0.0006 1.1865 18.4200 24.4561 33.8202
frequency: 18.0007 23.9358 33.7959 71.4502 75.8837 87.8620 117.6083 153.8031 160.7838 172.9655 185.6316 206.8812 217.4316 246.5591 250.9767 258.2290 270.9047 290.5636 314.1366 344.4743 353.0838 383.7906 403.9799 407.5878 425.6166 431.3423 454.7174 458.8912 475.5521 485.8040 528.8433 551.6094 573.9755 588.1056 609.9651 635.6759 669.6377 697.8033 720.8685 732.7422 770.3022 786.5835 804.6783 810.4240 838.0431 845.5247 855.9740 858.5068 872.6269 908.4089 918.0132 937.4754 947.9391 948.5043 955.6771 967.3498 978.8346 998.9967 1009.7142 1033.9543 1047.5516 1053.9007 1075.3674 1081.0357 1097.3794 1113.1997 1118.6139 1137.0067 1139.2374 1150.5623 1162.7518 1168.7860 1180.1001 1184.7988 1196.9909 1205.9997 1214.5913 1247.4642 1252.5339 1266.2077 1272.2681 1277.1166 1282.0809 1290.2808 1312.8177 1314.1748 1316.9996 1329.0480 1342.4963 1349.6605 1353.7483 1367.5838 1373.0774 1374.6575 1390.3262 1431.8995 1433.0194 1456.4403 1461.0860 1462.7303 1465.9908 1467.7205 1474.1209 1476.3164 1477.6037 1483.1352 1487.2716 1492.9641 1522.1969 1608.3538 1614.2376 1628.1559 1658.2250 2806.6787 2890.3896 2901.1527 2915.3511 2930.8340 2973.5757 2977.2281 2998.5427 3008.0701 3027.1901 3041.8129 3045.0007 3058.2414 3064.8154 3066.5347 3075.9558 3087.6251 3093.7533 3099.8500 3124.8519 3133.0819 3146.6607 3161.1944 3196.0287 3565.1965
redmass: 2.9211 4.2207 3.6705 3.8920 5.6815 4.1268 3.6121 1.9096 3.0145 1.9250 2.7818 2.6860 1.0257 2.1473 1.9693 2.3647 2.8838 3.0989 3.9310 4.2179 2.5434 3.5268 3.2903 3.2504 3.0625 2.9659 1.7123 2.3545 3.1689 3.5654 3.6678 5.2295 3.5198 4.2683 3.5690 3.4706 4.0131 4.0209 3.3308 2.1645 3.9351 2.7211 3.3110 4.4576 1.7581 1.6913 1.6553 1.8155 1.6324 2.5384 1.2875 2.3232 1.7032 1.5741 1.3341 2.1388 3.1042 3.1870 2.5059 2.2830 2.1022 2.2450 2.0993 3.2663 2.1663 1.6973 1.7488 1.7664 2.1141 1.2949 2.1700 1.3996 2.1187 1.3888 1.7096 2.2041 1.9036 1.3238 1.5345 1.7027 1.4658 1.6411 1.4889 1.4510 1.7351 1.6813 1.5435 1.3511 1.7239 1.2278 1.6121 1.3962 1.2165 2.4405 1.2297 2.6119 1.1951 2.0900 1.2641 1.0592 1.0864 1.0462 1.0799 1.0895 2.5253 1.0539 1.0493 1.2867 1.6459 6.8398 6.8165 8.5833 7.8408 1.0791 1.0574 1.0669 1.0724 1.0790 1.0365 1.0367 1.0593 1.0841 1.0842 1.0896 1.0791 1.0951 1.1018 1.0989 1.0988 1.0999 1.0998 1.0991 1.0860 1.0906 1.0918 1.0974 1.0843 1.0781
irintensity: 0.0711 0.2213 0.0310 1.8711 6.0845 1.0685 0.4713 0.8850 0.7287 1.6259 14.9386 0.8434 0.0088 2.5807 1.0976 5.9598 3.5336 1.8843 1.4287 0.3861 0.3579 10.4266 3.0985 9.7738 2.3451 1.3649 126.6181 74.6625 2.8727 2.0359 5.5193 0.5076 3.1428 3.2465 1.6610 8.4356 17.0488 1.1013 3.7557 28.3031 1.7030 71.4731 1.3925 0.3266 16.3379 39.8127 2.1847 0.5550 41.6111 8.4362 0.9699 7.2081 3.4344 1.3565 3.7298 10.2129 4.6519 8.5479 4.2901 18.8839 19.7109 6.9860 9.0302 9.6029 15.3852 7.2790 10.0513 7.6119 11.4100 8.0876 2.3570 2.0934 21.2632 9.3678 7.0829 13.1424 76.2383 27.3792 10.1806 21.6468 31.8971 6.2592 4.7600 2.3219 1.7807 5.8327 0.7031 3.9005 11.2804 8.5688 1.3388 4.3541 25.1868 14.3003 26.0204 3.1504 9.7721 48.6434 25.7973 11.8707 13.0077 2.6193 8.5130 18.0001 2.1969 18.5401 22.6044 21.6436 268.1966 16.6029 362.4256 59.6868 7.1958 62.2686 54.0290 158.0457 64.0016 48.2606 20.2435 33.5225 33.0552 5.8658 16.7242 17.5556 49.1000 23.1730 67.1727 7.5335 78.6177 45.0115 27.2700 25.7276 10.5396 13.2181 16.5489 25.9931 326.6062 19.6391
temp: 298.150 k
press: 1.00000 atm
elementType: 8 7 7 7 6 6 6 6 6 6 6 6 6 6 6 6 6 6 6 6 6 6 6 1 1 1 1 1 1 1 1 1 1 1 1 1 1 1 1 1 1 1 1 1 1 1 1 1
symmnumber: 1
zpe: 1068686.9 jmol-1
zpe.correction: 0.407041 hartree
zpe.thermalcorrener: 0.428305 hartree
zpe.thermalcorrenthalpy: 0.429250 hartree
zpe.thermalcorrgfe: 0.356311 hartree
zpe.sumelectzpe: -976.794246 hartree
zpe.sumelectthermal: -976.772982 hartree
zpe.sumelectthermalent: -976.772038 hartree
zpe.sumelectthermalfe: -976.844977 hartree
dipole: 2.7507 -5.8371 0.1397
dipole: 6.4543
quadrupole: -141.5975 -136.8594 -130.1007
quadrupole: 9.8418 9.6084 -0.3436
quadrupole: -5.4116 -0.6735 6.0852 9.8418 9.6084 -0.3436
hfenergy: -977.2012875 hartree
pointgroup: C01 [X(C19H25N3O1)]
dipole: 0.9825144 2.1029955 -1.0296576 debye
polarizability: 280.7124152|-5.0496082|222.9540497|-40.2207866|-24.3749534|191.1859984 unknown
InChI: InChI=1S/C19H25N3O/c1-11(2)21-19(23)13-7-15-14-5-4-6-16-18(14)12(9-20-16)8-17(15)22(3)10-13/h4-7,11-13,17,20-21H,8-10H2,1-3H3
charge 0 multiplicity 1
48 atoms
O  -3.759934 -2.13485 1.388534
N  -1.339203 1.566968 1.060378
N  4.050459 0.661665 -1.740697
N  -3.207165 -0.325819 0.010986
C  2.141377 1.473207 -0.57161
C  0.102035 1.214048 0.857251
C  0.617941 1.690694 -0.539921
C  2.448139 0.034079 -0.219449
C  0.356022 -0.297694 1.061857
C  1.662552 -0.815196 0.570502
C  2.935881 1.649512 -1.901017
C  -1.891905 0.908832 2.285211
C  -1.936801 -0.620288 2.102429
C  3.6130 -0.388688 -0.903084
C  -0.589708 -1.109955 1.617987
C  2.167045 -2.138965 0.780421
C  -1.573152 3.03129 1.115579
C  4.11582 -1.690367 -0.697742
C  -3.065523 -1.098773 1.138423
C  3.374347 -2.541358 0.170813
C  -4.203485 -0.62423 -1.038575
C  -3.704868 -0.07054 -2.388435
C  -5.597403 -0.067208 -0.658604
H  2.604976 2.138382 0.190661
H  0.717337 1.75785 1.625587
H  0.371455 2.755503 -0.698678
H  0.121836 1.098692 -1.332542
H  2.292695 1.394507 -2.774285
H  3.328158 2.671789 -2.034217
H  -2.908023 1.307254 2.456862
H  -1.273583 1.153204 3.181884
H  -2.175534 -1.096763 3.071266
H  -0.406146 -2.187097 1.70477
H  4.681838 0.479457 -2.521115
H  1.624936 -2.849771 1.411747
H  -1.299875 3.511793 0.163077
H  -0.998439 3.525855 1.935376
H  -2.647505 3.216102 1.288299
H  5.023113 -2.051503 -1.193397
H  3.745357 -3.557254 0.351101
H  -2.581205 0.504909 -0.048017
H  -4.282471 -1.727016 -1.093216
H  -4.423203 -0.313556 -3.1913
H  -3.602008 1.031563 -2.350654
H  -2.724566 -0.503987 -2.656126
H  -5.919622 -0.484585 0.310741
H  -6.348687 -0.343093 -1.421924
H  -5.570607 1.036101 -0.580036
