program: Gaussian 09
title: 000297896
version: EM64L-G09RevD.01
frameworkgroup: C1[X(C10H6N2S)]
method: RPBEPBE
basis: SDD
operation: Freq
keyword: #p
keyword: freq=noraman
keyword: PBEPBE/SDD
title: #p freq=noraman PBEPBE/SDD
converged: NO YES NO NO
title: Mulliken charges:
elementType: S N N C C C C C C C C C C H H H H H H
charge: 0.639104 -0.452106 -0.452104 0.165160 0.472285 0.108250 0.108246 -0.453796 -0.453795 -0.363880 -0.363882 -0.211445 -0.211443 0.241629 0.241628 0.258804 0.258804 0.234272 0.234271
chargesum: 0.00000
title: Mulliken charges with hydrogens summed into heavy atoms:
elementType: S N N C C C C C C C C C C
charge: 0.639104 -0.452106 -0.452104 0.165160 0.472285 0.108250 0.108246 -0.212167 -0.212167 -0.105076 -0.105078 0.022827 0.022828
polarizability: 1.87121507e+02 -3.46728822e-04 2.03985271e+02 9.12787507e-03 -8.61882553e-05 5.23640497e+01
1716.lowfreq: -6.6110 -0.0019 -0.0003 0.0004 3.0315 7.6961 121.6251 136.7931 205.8906
frequency: 121.6110 136.7918 205.8905 240.5267 346.1747 365.8731 404.0541 415.6263 430.9601 475.0417 488.9682 536.3628 547.2600 598.0136 638.9273 653.9998 707.0925 761.0268 765.0244 766.9126 788.7924 839.0829 857.0509 879.1393 906.9433 976.9049 985.2615 1023.3845 1029.8029 1078.8131 1121.7705 1148.7833 1177.3235 1186.8664 1222.1424 1243.7849 1341.2216 1356.3312 1409.2042 1420.4160 1422.0942 1496.0537 1553.0303 1585.9946 1609.6605 3131.3165 3133.1125 3153.4273 3154.7428 3176.5314 3177.1351
redmass: 7.9229 5.3524 5.2932 3.8808 8.7139 7.6347 10.7133 4.9333 10.7490 3.5043 4.1208 7.4180 7.9773 3.8033 2.8457 8.6992 10.0784 1.9585 5.8231 1.3322 9.8066 2.4000 7.2731 1.3792 1.5086 1.3322 1.3628 4.6962 3.8945 1.8185 2.1656 3.3818 1.2907 1.1973 1.8232 3.1475 2.4118 4.2016 4.6385 2.4264 2.3253 4.0618 6.1438 6.1194 7.0539 1.0868 1.0867 1.0942 1.0937 1.0966 1.0966
irintensity: 0.0000 0.2154 8.8452 0.0000 2.4809 13.7326 0.4868 12.8282 3.3392 0.7462 0.0000 11.0383 2.1576 11.6734 0.0000 14.1757 4.2210 70.8396 3.1735 0.0000 0.0186 94.0454 4.0382 0.0000 1.1122 0.0000 2.8399 8.7554 1.2417 0.2529 3.9411 42.9474 5.8990 3.4535 1.0522 0.2705 14.1223 0.8189 52.8612 9.7489 23.4121 0.1232 22.1456 2.1280 42.1031 7.2767 1.4087 13.4181 33.0679 17.0751 1.6934
temp: 298.150 k
press: 1.00000 atm
elementType: 16 7 7 6 6 6 6 6 6 6 6 6 6 1 1 1 1 1 1
symmnumber: 1
zpe: 348067.0 jmol-1
zpe.correction: 0.132572 hartree
zpe.thermalcorrener: 0.141744 hartree
zpe.thermalcorrenthalpy: 0.142688 hartree
zpe.thermalcorrgfe: 0.098069 hartree
zpe.sumelectzpe: -891.288744 hartree
zpe.sumelectthermal: -891.279572 hartree
zpe.sumelectthermalent: -891.278628 hartree
zpe.sumelectthermalfe: -891.323247 hartree
dipole: 2.1640 0.0000 0.0002
dipole: 2.1640
quadrupole: -74.9386 -77.2494 -85.4892
quadrupole: 0.0000 0.0005 0.0001
quadrupole: 4.2871 1.9763 -6.2635 0.0000 0.0005 0.0001
hfenergy: -891.4213157 hartree
pointgroup: C01 [X(C10H6N2S1)]
dipole: -0.8513668 -0.0006789 0.0000665 debye
dipolederiv: 0.2933413 -0.0002759 -0.0000044 -0.0002661 0.6297399 0.0000019 -0.000009 0.0000057 0.2815651 -0.3341685 -0.2252354 0.0000108 -0.3699436 -0.3216027 0.0000323 0.0000052 0.0000179 -0.2688677 -0.335147 0.2252113 0.0000111 0.3699151 -0.3206361 -0.0000296 0.0000142 -0.0000335 -0.2688666 0.1677993 0.0006901 -0.0000067 0.0006932 -0.6820477 0.0000029 0.0000027 0.0000007 0.0284152 -0.5335516 -0.0005514 0.0000401 -0.0005461 0.1466384 -0.0000083 0.00003 -0.0000021 0.0875829 0.244778 0.2358469 -0.0000252 -0.2597971 0.1411833 0.0000194 -0.0000235 -0.0000158 0.1139564 0.2447491 -0.2356706 -0.0000222 0.2599647 0.1412246 -0.0000274 -0.0000155 0.0000212 0.1139552 0.0939575 0.1540256 0.0000015 -0.2578569 -0.2819443 0.0000272 -0.0000022 -0.0000188 -0.2170809 0.093788 -0.1534151 -0.0000148 0.2584631 -0.2817729 -0.0000221 -0.0000223 0.0000169 -0.2170823 -0.2831581 0.0564663 0.0000237 0.2771985 0.1054837 -0.0000033 0.000017 0.0000125 -0.1927565 -0.2826194 -0.0571018 0.0000106 -0.2778304 0.104936 0.0000174 0.000016 0.000007 -0.192758 0.3295759 0.0661246 -0.0000303 -0.023975 0.2871329 0. -0.0000215 -0.0000027 -0.1337287 0.3296459 -0.0660508 -0.0000371 0.0240415 0.2870625 -0.0000123 -0.0000412 -0.0000203 -0.1337289 -0.0992887 0.0199263 0.0000032 -0.0481249 0.0794033 0.0000008 0.0000033 0.0000027 0.1681629 -0.0993342 -0.0202166 0.0000152 0.0478349 0.0794486 0. 0.0000146 0.000005 0.1681628 0.0456852 -0.0896327 0.0000011 -0.0509876 0.0148714 -0.000007 0.0000042 -0.0000107 0.1729965 0.0454579 0.0896805 0.000008 0.0510367 0.0151014 0.0000015 0.0000113 0.000002 0.1729967 0.0390674 0.1130116 0.0000046 0.1065544 -0.0719327 -0.000008 0.0000047 -0.0000024 0.1585381 0.0394218 -0.1128329 0.0000109 -0.1063743 -0.0722898 0.0000145 0.0000118 0.0000148 0.1585378 unknown
polarizability: 187.1215189|-0.0139505|203.9852599|-0.0091279|0.0000788|52.3640497 unknown
InChI: InChI=1S/C10H6N2S/c1-3-7-4-2-6-9-10(7)8(5-1)11-13-12-9/h1-6H
charge 0 multiplicity 1
19 atoms
S  3.061369 0.002484 -0.000292
N  2.115571 1.431727 -0.000186
N  2.117896 -1.428302 -0.000225
C  0.005591 0.000003 -0.000064
C  -1.434295 -0.001163 0.000018
C  0.702863 1.286954 -0.00008
C  0.704953 -1.285814 -0.000105
C  -2.139766 1.255162 0.000047
C  -2.137726 -1.258633 0.000091
C  -0.028012 2.49338 0.000006
C  -0.023962 -2.493425 -0.000013
C  -1.449022 2.468832 0.000055
C  -1.445011 -2.471178 0.000086
H  -3.23541 1.239837 0.000054
H  -3.233394 -1.245086 0.000152
H  0.53192 3.432587 0.000039
H  0.537489 -3.431724 -0.000026
H  -2.001399 3.414334 0.000087
H  -1.995856 -3.417573 0.000158
