program: Gaussian 09
title: 000297903
version: EM64L-G09RevD.01
frameworkgroup: C1[X(C15H19NO)]
method: RPBEPBE
basis: SDD
operation: Freq
keyword: #p
keyword: freq=noraman
keyword: PBEPBE/SDD
title: #p freq=noraman PBEPBE/SDD
converged: YES YES NO NO
title: Mulliken charges:
elementType: O N C C C C C C C C C C C C C C C H H H H H H H H H H H H H H H H H H H
charge: -0.232580 -0.153035 -0.271532 -0.573441 -0.551208 0.583365 0.489832 0.166738 -0.505386 -0.502203 -0.417450 -0.826045 0.399269 -0.356926 -0.383101 -0.646974 -0.647173 0.234929 0.235002 0.234975 0.259546 0.231007 0.253750 0.227489 0.218184 0.239662 0.231352 0.233657 0.234696 0.233697 0.232736 0.231686 0.215398 0.232899 0.216002 0.231184
chargesum: 0.00000
title: Mulliken charges with hydrogens summed into heavy atoms:
elementType: O N C C C C C C C C C C C C C C C
charge: -0.232580 -0.153035 -0.036603 -0.103464 -0.060655 0.583365 0.489832 0.166738 -0.251637 -0.274715 -0.199266 -0.121375 0.399269 -0.122230 -0.149404 0.032846 0.032912
polarizability: 2.57685181e+02 7.11511746e+00 1.46398293e+02 -2.90999816e+00 -1.23524021e+00 1.37737225e+02
1716.lowfreq: -9.5103 -6.2241 -0.0004 0.0005 0.0008 9.7417 23.5236 41.2514 64.2977
frequency: 23.3619 41.2079 64.2096 75.9803 93.4466 101.9143 136.2232 144.3601 167.0703 195.0654 206.5361 208.8273 237.4421 282.8546 300.8202 376.4571 401.1997 411.9453 418.6773 438.5813 470.5003 485.7907 500.3328 533.7698 547.2980 550.7899 613.6647 641.2350 719.0713 736.5196 802.4079 805.9416 812.3355 825.2160 874.6673 893.4412 905.1723 908.8575 934.8908 946.2108 948.4786 997.8090 1007.4049 1012.3184 1051.1825 1056.9677 1102.7714 1110.0114 1111.1012 1129.1150 1138.8061 1155.5682 1166.5398 1197.6740 1216.8452 1236.4216 1255.2325 1260.8225 1265.4972 1283.1157 1313.1185 1325.1315 1343.5609 1358.1888 1359.9786 1389.0752 1393.3830 1426.6756 1434.2763 1438.3864 1446.5030 1458.9501 1459.7940 1462.3323 1463.3769 1474.2720 1495.4274 1508.5905 1528.8848 1565.9929 1581.2017 1635.5727 1642.9718 2932.9159 2941.6312 2950.5504 2965.0632 2968.0826 2981.7247 2996.2314 2999.0870 3018.5263 3036.6349 3068.5636 3091.4094 3093.5716 3103.0943 3107.8623 3112.4477 3131.5029 3159.6595 3164.3689
redmass: 3.6107 3.9980 4.1021 2.4376 2.6182 2.4990 1.8065 1.6972 2.4108 2.0492 3.6812 1.1375 2.0779 2.9806 3.1712 5.3978 3.1078 3.4992 2.9446 2.4436 3.2062 3.7003 3.9625 2.8477 2.3229 3.6033 3.5435 5.9292 4.8767 3.4643 4.9230 1.2710 1.7867 1.4694 2.6407 3.2578 1.4455 2.7362 1.4167 3.0328 1.3626 2.8276 1.5580 1.6889 1.9042 1.5042 3.4515 1.3104 1.2462 1.4379 1.2810 2.4392 1.7361 1.2397 1.2070 2.0278 1.8429 1.3564 2.9035 1.8801 1.5936 1.2627 1.8110 2.5287 3.1331 3.1488 1.2627 1.6404 1.0849 1.6897 1.0889 1.0533 1.2031 1.0822 1.0406 1.0467 1.0856 1.1086 2.6209 6.3980 9.4320 6.2599 6.2458 1.0370 1.0397 1.0648 1.0396 1.0700 1.0758 1.0991 1.1028 1.0951 1.0957 1.0949 1.0986 1.0955 1.0936 1.0887 1.0892 1.0920 1.0923 1.0930
irintensity: 0.9516 1.5897 0.4052 0.0757 5.8891 2.1087 0.4296 0.1751 1.7850 0.5529 0.4075 0.0295 1.7973 0.5896 1.5051 5.6243 0.3261 6.0803 0.1015 0.6600 8.7768 3.5632 9.4013 2.6776 14.4436 2.9739 3.9445 1.1566 0.9506 0.2509 2.1860 1.9868 61.6519 11.7082 6.3799 3.0026 17.4061 3.8268 0.1431 17.3382 0.2802 0.1473 8.0320 4.0364 18.6255 21.8065 0.1457 0.8857 0.1241 2.8561 6.2391 0.8294 10.5764 28.8586 7.3788 7.2393 64.2136 20.9489 33.0784 33.7135 1.9330 1.1413 21.4163 120.2973 74.3458 13.0165 27.1839 5.1594 10.3169 0.0989 11.8374 12.5115 12.1331 16.7036 0.0048 20.8731 1.6605 30.9118 273.5614 4.0857 220.2863 165.6512 107.0483 120.2135 94.2938 8.4069 21.7364 10.2688 25.9567 5.0296 92.5421 23.8655 18.9473 11.2389 27.2143 4.8462 54.2708 19.5466 20.3233 16.3753 24.5615 12.0420
temp: 298.150 k
press: 1.00000 atm
elementType: 8 7 6 6 6 6 6 6 6 6 6 6 6 6 6 6 6 1 1 1 1 1 1 1 1 1 1 1 1 1 1 1 1 1 1 1
symmnumber: 1
zpe: 794718.4 jmol-1
zpe.correction: 0.302692 hartree
zpe.thermalcorrener: 0.319812 hartree
zpe.thermalcorrenthalpy: 0.320756 hartree
zpe.thermalcorrgfe: 0.256848 hartree
zpe.sumelectzpe: -711.694532 hartree
zpe.sumelectthermal: -711.677412 hartree
zpe.sumelectthermalent: -711.676468 hartree
zpe.sumelectthermalfe: -711.740375 hartree
dipole: 5.0400 4.4233 -0.2659
dipole: 6.7110
quadrupole: -91.7247 -112.5536 -95.2873
quadrupole: -19.9420 -0.9906 -0.7963
quadrupole: 8.1305 -12.6984 4.5679 -19.9420 -0.9906 -0.7963
hfenergy: -711.9972239 hartree
pointgroup: C01 [X(C15H19N1O1)]
dipole: -1.9941253 1.6683315 0.4598544 debye
polarizability: 257.7203291|-5.4154882|145.4820993|-5.1261139|2.8151478|138.61827 unknown
InChI: InChI=1S/C15H19NO/c1-11-8-13(10-15(17)9-11)12-4-6-14(7-5-12)16(2)3/h4-7,9,13H,8,10H2,1-3H3
charge 0 multiplicity 1
36 atoms
O  4.135587 -2.378018 -0.425136
N  -4.477117 0.0256 0.14998
C  1.312189 0.021887 -0.450376
C  1.99169 1.197117 0.306303
C  1.967792 -1.316435 -0.012658
C  -0.204291 0.02083 -0.284477
C  3.509923 1.160654 0.220976
C  3.489886 -1.310093 -0.187016
C  4.178452 -0.011176 -0.029457
C  -1.062005 0.193936 -1.398655
C  -0.821155 -0.150997 0.982164
C  4.235241 2.470157 0.431512
C  -3.083548 0.025134 0.007208
C  -2.464959 0.197261 -1.271025
C  -2.219547 -0.149702 1.136066
C  -5.33356 0.200248 -1.027761
C  -5.080267 -0.167156 1.473091
H  1.537878 0.158821 -1.528192
H  1.6925 1.171223 1.37655
H  1.615166 2.163248 -0.083329
H  1.551428 -2.172258 -0.571994
H  1.753376 -1.502708 1.060726
H  5.272621 -0.035668 -0.106028
H  -0.622529 0.326295 -2.395989
H  -0.200821 -0.294845 1.876782
H  5.331009 2.346367 0.422655
H  3.942592 2.928299 1.397076
H  3.959439 3.200689 -0.354668
H  -3.076105 0.331136 -2.16812
H  -2.640786 -0.28764 2.136057
H  -5.180182 -0.6055 -1.775554
H  -5.148487 1.170665 -1.533277
H  -6.390855 0.177499 -0.71947
H  -4.795289 -1.142168 1.919891
H  -6.17785 -0.146022 1.382287
H  -4.783418 0.631523 2.184159
