program: Gaussian 09
title: 000297890
version: EM64L-G09RevD.01
frameworkgroup: C1[X(C8H5BrINO4)]
method: RPBEPBE
basis: SDD
operation: Freq
keyword: #p
keyword: freq=noraman
keyword: PBEPBE/SDD
title: #p freq=noraman PBEPBE/SDD
converged: NO YES NO NO
title: Mulliken charges:
elementType: I Br O O O O N C C C C C C C C H H H H H
charge: 0.258567 0.091091 -0.286855 -0.230573 -0.191096 -0.176595 0.027950 0.290669 0.510527 -0.490874 -0.274543 -0.508716 -0.084131 0.185369 -0.496836 0.333758 0.305503 0.238666 0.249176 0.248941
chargesum: 0.00000
title: Mulliken charges with hydrogens summed into heavy atoms:
elementType: I Br O O O O N C C C C C C C C
charge: 0.258567 0.091091 -0.286855 -0.230573 -0.191096 -0.176595 0.027950 0.290669 0.510527 -0.157115 0.030961 -0.508716 -0.084131 0.185369 0.239947
polarizability: 2.39107747e+02 -7.59418592e+00 1.80839058e+02 8.03172611e-03 -3.61222774e-04 5.64604050e+01
1716.lowfreq: -57.8833 -5.3122 -0.0006 -0.0004 0.0003 1.8102 1.9773 28.6079 45.1904
frequency: -57.8709 28.6052 45.1902 83.3548 92.5419 101.4491 127.7408 165.3823 170.9539 185.2199 189.0436 248.6163 265.6114 291.3114 329.6134 331.6599 439.1454 482.9332 503.9932 522.8851 576.3334 665.4236 687.5208 698.2450 721.9767 735.9849 780.3430 832.3890 940.8693 944.6975 978.6842 994.2631 1092.2856 1105.6892 1115.6349 1152.0773 1171.4306 1185.0465 1243.1297 1339.2433 1362.0372 1378.5406 1421.4595 1431.4841 1453.2881 1462.1947 1544.2923 1588.8499 1632.7263 3009.6098 3113.6080 3157.3713 3183.2634 3194.3524
redmass: 16.2765 14.5961 6.9048 2.5341 5.8811 1.4233 69.3739 25.6456 5.0036 4.6446 14.7260 5.4468 15.4490 7.9467 6.5275 11.7959 8.6019 5.8416 8.4237 5.5935 6.3878 8.7647 11.4458 7.1447 4.0688 9.1263 9.6168 9.3875 1.4929 9.4902 1.4276 7.6820 5.2776 1.9806 1.2637 1.5223 1.9706 14.0914 3.0519 3.8279 4.7467 5.5455 1.8536 2.1583 1.0489 1.0514 9.7512 6.7839 10.4680 1.0295 1.1049 1.1051 1.0915 1.0932
irintensity: 0.0140 1.0762 0.6912 0.0072 0.4572 0.3262 0.4761 0.5905 7.0979 0.4068 1.2020 5.5276 2.3228 8.9456 19.2458 1.3617 1.7000 6.0771 12.9599 0.2602 8.0447 3.0061 43.9514 19.6833 17.2864 7.7183 0.5559 8.7657 12.5333 13.9685 17.0828 74.3791 255.0818 60.1223 0.0201 73.4376 19.8428 221.6278 315.5559 14.0790 58.0175 13.2776 114.0435 17.5709 16.0664 12.3254 16.0936 61.5018 176.6792 32.9157 21.4625 12.0735 20.9013 2.7474
temp: 298.150 k
press: 1.00000 atm
elementType: 53 35 8 8 8 8 7 6 6 6 6 6 6 6 6 1 1 1 1 1
symmnumber: 1
zpe: 314017.3 jmol-1
zpe.correction: 0.119603 hartree
zpe.thermalcorrener: 0.133833 hartree
zpe.thermalcorrenthalpy: 0.134778 hartree
zpe.thermalcorrgfe: 0.074912 hartree
zpe.sumelectzpe: -687.277642 hartree
zpe.sumelectthermal: -687.263411 hartree
zpe.sumelectthermalent: -687.262467 hartree
zpe.sumelectthermalfe: -687.322333 hartree
dipole: -2.7227 -4.8907 -0.0050
dipole: 5.5975
quadrupole: -90.2183 -125.8180 -108.4915
quadrupole: 6.6463 0.0045 -0.0122
quadrupole: 17.9577 -17.6421 -0.3156 6.6463 0.0045 -0.0122
hfenergy: -687.3972448 hartree
pointgroup: C01 [X(C8H5Br1I1N1O4)]
dipole: -1.5818206 -1.5281488 -0.1116141 debye
dipolederiv: -0.33378 0.2882047 -0.0051589 0.2099183 0.1361392 0.0075619 -0.0078319 0.0102457 0.1278644 0.0273843 0.0051237 0.0004495 0.0221697 -0.6416145 -0.0231549 0.0008925 -0.0236621 0.0195595 -1.5949894 -0.1438344 -0.0507811 -0.5580361 -0.5823175 -0.0303697 -0.0683807 -0.0161752 -0.2930804 -0.8247601 0.2820804 -0.0070273 0.0831302 -0.8665755 -0.0187342 -0.015001 -0.0110026 -0.3113314 -0.455809 -0.0359838 -0.0105959 0.0439801 -0.935853 -0.022895 -0.0072367 -0.027058 -0.2139689 -0.7114402 -0.1013697 -0.0227455 -0.0421299 -0.4876992 -0.0120503 -0.0212843 -0.0139554 -0.1887247 1.1923833 0.5087953 0.0558967 0.1878528 1.5207573 0.0528009 0.0436039 0.0645214 0.1827643 -0.5472744 0.114524 -0.0150954 0.160168 -0.1939317 -0.0023087 -0.0128879 -0.0038895 0.0139055 -0.4704969 -0.2494732 -0.0295913 -0.135365 -0.4579377 -0.0254438 -0.0252542 -0.0290759 0.1154834 0.12562 0.1499678 0.0121905 0.1333765 -0.1451326 0.0019907 0.012489 0.0032645 -0.0758773 0.1685654 0.0756079 0.0093828 -0.2363335 -0.1786162 -0.013437 -0.0018658 -0.0026145 -0.027344 0.9275153 -0.4532435 0.0193115 -0.1999826 -0.0603582 -0.0039905 0.028657 -0.0128413 -0.1310718 -0.6877772 -0.1171174 -0.0243652 0.0285627 1.234282 0.0488152 -0.0191941 0.0437229 -0.0924918 2.1452941 -0.2336814 0.0573222 0.3184833 1.1493101 0.0464544 0.0781761 0.0263304 0.2405979 0.8226948 0.0123321 0.0189259 -0.0224504 0.2144378 -0.0029567 0.0193623 -0.0010403 0.2764033 0.173174 0.0153815 0.0006955 0.0092621 0.1418112 -0.0007535 0.0002853 -0.0006826 0.1704825 0.1091709 -0.048676 -0.0032242 -0.0461183 0.0870397 -0.0039864 -0.0030754 -0.004114 0.1530094 -0.0049892 -0.0504502 -0.0069454 -0.1255938 -0.0385947 -0.0124341 -0.010405 -0.009563 0.1242804 -0.0280645 -0.0121762 0.0058891 0.0831511 0.0447784 0.1040102 -0.0398012 0.0771339 -0.038392 -0.0324213 -0.0060116 -0.0045333 0.0859547 0.0600751 -0.0891184 0.048752 -0.0695442 -0.0520683 unknown
polarizability: 229.798886|-22.6666224|189.8249682|5.123074|4.0596265|56.7833563 unknown
InChI: InChI=1S/C8H5BrINO4/c1-15-8(12)4-2-5(9)7(10)6(3-4)11(13)14/h2-3H,1H3
charge 0 multiplicity 1
20 atoms
I  3.621545 -1.648657 0.036142
Br 0.771832 -3.705696 -0.134971
O  -3.417649 -0.450768 -0.162372
O  -2.796712 1.794879 -0.055677
O  1.872238 2.853847 0.137593
O  3.575562 1.356225 0.148458
N  2.326106 1.645356 0.110968
C  -1.084788 0.058536 -0.061963
C  1.309894 0.536744 0.03642
C  -0.028144 0.983443 0.007389
C  -0.797307 -1.324213 -0.102442
C  1.638668 -0.856008 -0.00272
C  0.539001 -1.764884 -0.072943
C  -2.485785 0.581708 -0.090244
C  -4.83993 -0.02737 -0.196089
H  -0.235407 2.056083 0.039363
H  -1.617392 -2.04293 -0.156406
H  -5.409373 -0.964327 -0.260685
H  -5.022451 0.614196 -1.073965
H  -5.089408 0.530632 0.721545
