program: Gaussian 09
title: 000297916
version: EM64L-G09RevD.01
frameworkgroup: C1[X(C17H20O7)]
method: RPBEPBE
basis: SDD
operation: Freq
keyword: #pfreq=noraman
keyword: PBEPBE/SDD
title: #p freq=noraman PBEPBE/SDD
converged: YES YES NO NO
title: Mulliken charges:
elementType: O O O O O O O C C C C C C C C C C C C C C C C C H H H H H H H H H H H H H H H H H H H H
charge: -0.256855 -0.416831 -0.184705 -0.184964 -0.264133 -0.218170 -0.436977 -0.300025 -0.343682 -0.300398 0.488327 0.217172 0.218406 0.253320 0.161302 -0.584287 -0.427980 -0.794511 -0.784510 0.298568 -0.209199 -0.413777 -0.260254 -0.666599 0.289375 0.312084 0.331405 0.278682 0.302090 0.243842 0.255765 0.275627 0.252988 0.263430 0.258068 0.226380 0.221264 0.383473 0.230364 0.236488 0.355272 0.219096 0.229158 0.245914
chargesum: 0.00000
title: Mulliken charges with hydrogens summed into heavy atoms:
elementType: O O O O O O O C C C C C C C C C C C C C C C C C
charge: -0.256855 -0.033358 -0.184705 -0.184964 -0.264133 -0.218170 -0.081704 -0.010649 -0.031599 0.031006 0.488327 0.217172 0.218406 0.253320 0.161302 -0.305605 -0.125891 -0.019277 -0.010025 0.298568 0.017180 -0.192513 0.206597 0.027568
polarizability: 2.44811008e+02 -8.76586673e+00 1.73646971e+02 1.58130201e-02 4.58387897e+00 1.83596753e+02
1716.lowfreq: -9.9055 -6.8142 0.0001 0.0004 0.0008 4.3192 15.7090 25.9974 31.8279
frequency: 15.5198 25.9207 31.7754 38.4192 43.2460 54.4236 58.2259 63.5142 68.6996 88.4556 98.4428 118.8001 124.6564 134.7205 153.6312 172.1465 176.3402 191.9439 210.8366 216.2734 223.3367 226.7833 242.6029 261.5696 314.1546 337.6796 345.6300 356.0407 397.1218 407.5707 442.2133 471.2355 492.2865 498.9068 515.2784 538.3568 550.3691 561.0797 579.9755 595.3572 622.9840 625.7365 673.1327 677.1984 706.6285 714.1020 741.9863 788.3828 804.2499 815.9970 835.9004 862.2982 886.0505 895.7378 901.0847 911.2126 914.5381 958.9599 968.1952 984.2509 986.7203 1000.7666 1008.7896 1020.7712 1034.2753 1067.9757 1088.3197 1095.8609 1104.2518 1134.3181 1147.2889 1157.6051 1159.0168 1172.8214 1177.6429 1190.5514 1212.2885 1227.7715 1239.8494 1263.2409 1277.2838 1286.5059 1289.4957 1323.1052 1340.8928 1346.3899 1361.0128 1366.7195 1369.9624 1389.7742 1394.9922 1443.8084 1447.2464 1449.2391 1455.3509 1458.4400 1464.1190 1469.6303 1478.1527 1485.0935 1591.2393 1621.1852 1626.7970 1634.1849 1637.6704 1663.5296 2980.4925 2985.1034 2992.8262 3004.4870 3017.4115 3035.0824 3063.1712 3066.3957 3073.0292 3088.2391 3095.1912 3115.1105 3120.4815 3122.5580 3126.8816 3145.4752 3149.6483 3169.9647 3512.7324 3581.5398
redmass: 5.0666 5.0785 4.8346 4.1544 4.1426 4.1133 6.3112 4.7456 4.0359 5.5912 3.6759 5.0450 1.8250 2.8770 4.4539 2.1186 1.3289 5.0316 4.1176 2.4583 5.3279 4.2312 2.5370 4.6951 2.8586 3.9092 4.7628 1.1245 3.9527 3.9366 3.5047 3.3115 3.5267 4.0479 6.4620 4.0653 3.9299 3.7174 4.0205 2.3373 2.7774 3.2291 4.0239 3.4475 2.7086 3.8664 3.6962 1.5452 1.4218 4.1799 3.1575 3.4260 2.4128 1.4465 2.2266 4.1089 2.7611 2.1202 1.8902 1.4982 3.9594 2.1463 2.4707 2.2764 2.3817 3.4235 1.7528 2.1279 3.2844 1.9976 1.4944 1.7060 1.9119 2.3230 1.4435 1.4463 1.5549 1.4669 1.5976 2.3174 1.1240 1.5932 1.8904 1.3791 1.3712 1.4204 1.4347 1.2465 1.2425 1.2369 4.3626 1.0624 1.0676 1.0602 1.0657 1.0970 1.0456 2.5369 2.4732 1.0518 6.2123 8.2608 6.2513 7.6429 8.4738 9.0464 1.0373 1.0372 1.0360 1.0807 1.0832 1.0597 1.0845 1.0949 1.0956 1.0972 1.1027 1.0887 1.1007 1.1069 1.1011 1.0926 1.0919 1.0967 1.0641 1.0660
irintensity: 0.2620 1.0889 2.0281 1.2262 1.8025 0.9576 7.5218 1.1702 3.7207 3.2069 1.4816 2.2144 0.4144 0.9406 2.6097 1.3369 0.9842 4.5432 1.3714 1.7635 1.1685 2.7385 0.2260 0.8101 14.4990 0.7150 10.5330 131.8512 10.4189 10.0694 1.9783 10.9516 20.3456 26.1344 0.8224 18.9301 4.8074 13.1092 1.6030 58.3447 40.7820 31.9743 3.5459 22.8185 32.1550 11.8950 19.2975 34.8944 11.8190 6.3919 3.7738 4.8700 25.7565 4.7678 6.2942 3.9342 0.7265 19.7369 19.1592 1.2662 2.6559 50.9893 72.0668 53.6268 129.9177 179.8651 38.3162 19.5831 95.2749 207.2813 46.4995 5.4828 69.1762 83.6373 45.6091 81.3290 266.2120 6.5663 35.3571 59.3738 2.8994 91.7579 13.8581 23.3010 39.9584 3.1979 6.5210 75.1077 58.5682 20.2975 8.4812 13.0697 21.5251 13.7337 12.1703 12.9272 13.6430 10.7506 61.4179 11.8636 53.2634 72.8877 51.4311 143.0743 84.5571 238.0463 0.4288 3.0589 19.3531 8.1864 4.4128 24.2923 6.1516 3.3743 5.3443 36.2726 2.4239 17.2484 9.1809 30.2680 12.2161 15.7522 0.2869 18.8250 31.8445 37.9621
temp: 298.150 k
press: 1.00000 atm
elementType: 8 8 8 8 8 8 8 6 6 6 6 6 6 6 6 6 6 6 6 6 6 6 6 6 1 1 1 1 1 1 1 1 1 1 1 1 1 1 1 1 1 1 1 1
symmnumber: 1
zpe: 893251.2 jmol-1
zpe.correction: 0.340221 hartree
zpe.thermalcorrener: 0.366200 hartree
zpe.thermalcorrenthalpy: 0.367144 hartree
zpe.thermalcorrgfe: 0.281029 hartree
zpe.sumelectzpe: -1184.579319 hartree
zpe.sumelectthermal: -1184.553340 hartree
zpe.sumelectthermalent: -1184.552396 hartree
zpe.sumelectthermalfe: -1184.638512 hartree
dipole: -0.9501 1.0827 -2.4629
dipole: 2.8532
quadrupole: -113.9956 -143.3174 -140.1361
quadrupole: -12.3871 -7.3154 -5.9090
quadrupole: 18.4874 -10.8344 -7.6530 -12.3871 -7.3154 -5.9090
hfenergy: -1184.9195407 hartree
pointgroup: C01 [X(C17H20O7)]
dipole: 0.4422354 -0.3503344 -0.9704429 debye
polarizability: 241.663217|16.5273124|175.9260822|-3.2687725|-4.6317638|184.4654315 unknown
InChI: InChI=1S/C17H20O7/c1-4-24-17(23)14(10(3)19)15(13(9(2)18)16(21)22)11-6-5-7-12(20)8-11/h5-8,13-15,20-21H,4H2,1-3H3
charge 0 multiplicity 1
44 atoms
O  2.675669 2.31079 -0.244534
O  3.123394 -2.54477 -0.056557
O  -0.225051 3.163334 0.249515
O  -0.258163 -3.198966 1.299227
O  1.587589 0.918349 -1.75506
O  2.683085 -1.180718 1.769507
O  -4.759872 -1.082032 0.885548
C  0.10922 -0.346711 0.609901
C  0.900092 1.014897 0.650995
C  0.956833 -1.507602 0.003838
C  -1.26689 -0.286511 -0.072917
C  -0.035065 2.197768 1.028614
C  0.200429 -2.872067 0.178451
C  1.714978 1.373005 -0.59169
C  2.30838 -1.675889 0.684927
C  -2.403734 -0.69196 0.66654
C  -1.430522 0.133687 -1.42133
C  -0.701045 2.114273 2.393376
C  0.071201 -3.725313 -1.063212
C  -3.686639 -0.668584 0.075474
C  -2.717001 0.150167 -2.000974
C  -3.854945 -0.246492 -1.263947
C  3.517741 2.863906 -1.352176
C  4.754684 1.990503 -1.577789
H  -0.057587 -0.621684 1.668473
H  1.6327 0.919983 1.476289
H  1.135012 -1.34055 -1.071222
H  -2.308151 -1.054743 1.695528
H  -0.560995 0.454602 -2.001095
H  -0.003167 1.746611 3.166461
H  -1.092295 3.104794 2.673352
H  -1.550949 1.407046 2.345764
H  -0.399566 -4.691422 -0.825641
H  1.06613 -3.883539 -1.518578
H  -0.544567 -3.185414 -1.809061
H  -2.839095 0.483681 -3.037351
H  -4.851937 -0.224827 -1.723232
H  3.984626 -2.681678 0.424378
H  3.778837 3.872227 -0.994495
H  2.895591 2.930616 -2.261312
H  -5.614159 -1.03687 0.388623
H  5.409035 2.462437 -2.334173
H  5.332859 1.877957 -0.644407
H  4.46771 0.991406 -1.946428
