program: Gaussian 09
title: 000297879
version: EM64L-G09RevD.01
frameworkgroup: C1[X(C12H15NO2S)]
method: RPBEPBE
basis: SDD
operation: Freq
keyword: #p
keyword: freq=noraman
keyword: PBEPBE/SDD
title: #p freq=noraman PBEPBE/SDD
converged: YES YES NO NO
title: Mulliken charges:
elementType: S O O N C C C C C C C C C C C C H H H H H H H H H H H H H H H
charge: 0.971797 -0.523188 -0.532088 -0.363452 -0.699765 -0.521243 0.271405 0.260647 0.395342 -0.797192 -0.815071 -0.322353 -0.332720 -0.234072 -0.218101 -0.240338 0.273119 0.297032 0.254461 0.258676 0.232062 0.234071 0.241498 0.237747 0.233173 0.232603 0.247475 0.267710 0.226996 0.232096 0.231673
chargesum: 0.00000
title: Mulliken charges with hydrogens summed into heavy atoms:
elementType: S O O N C C C C C C C C C C C C
charge: 0.971797 -0.523188 -0.532088 -0.363452 -0.129614 -0.008107 0.271405 0.260647 0.395342 -0.089561 -0.111548 -0.074878 -0.065010 -0.007076 0.013995 -0.008665
polarizability: 2.48722767e+02 1.68976795e+01 1.69082011e+02 -4.10456344e+00 1.67933493e+01 1.16140001e+02
1716.lowfreq: -9.8663 -5.9163 -0.0024 -0.0019 -0.0010 1.7502 47.5675 51.5671 71.0787
frequency: 47.3920 51.5319 71.0196 93.3914 109.5102 113.2617 119.9265 171.2649 177.0312 181.7041 201.1077 261.3899 272.3258 301.1325 322.3200 339.6289 353.1435 377.3081 392.7293 406.5495 474.5404 511.7573 525.4268 533.1009 610.8055 624.1778 660.3268 686.5372 718.1933 770.5968 804.8274 823.1718 830.0591 857.9811 904.8438 919.0546 924.2222 949.2230 967.0782 982.8417 988.1186 991.2719 1020.4827 1029.0425 1034.5358 1052.2298 1088.6184 1109.1876 1146.5457 1167.6768 1173.7431 1187.3087 1218.3575 1226.3991 1254.7623 1275.8646 1320.6026 1351.7908 1384.7354 1389.9851 1400.7214 1406.0854 1431.4031 1441.1026 1457.9124 1464.6410 1470.8406 1474.4624 1494.2334 1578.9790 1600.6706 1705.2953 2898.9028 2967.9715 2969.8569 2998.4666 3026.4572 3038.2241 3038.5290 3103.3732 3106.3502 3113.8470 3129.0399 3140.0841 3153.3878 3165.0232 3180.3039
redmass: 3.6126 4.5382 4.2530 3.9470 1.1566 1.2766 2.4262 5.6285 4.9505 3.7466 3.6424 5.1088 5.0767 3.7795 2.4082 4.1154 2.8087 8.5406 6.0563 2.8341 3.3032 3.1204 4.9897 3.4574 6.3663 5.3647 5.7463 1.7707 3.5058 1.9212 6.3916 2.2685 1.9809 1.9249 1.5423 2.1307 2.6450 2.2752 1.4065 3.1778 1.8910 1.4059 2.7544 1.5078 2.3111 1.6396 1.6062 2.2399 2.5998 1.4874 1.0554 1.2140 1.7849 2.0318 1.4063 1.9221 1.3437 1.6383 5.5052 1.2501 1.1644 1.1315 1.1541 2.1073 1.0582 1.0530 1.0558 2.0529 1.0612 5.8622 5.9251 7.0693 1.0667 1.0397 1.0405 1.0900 1.0560 1.0968 1.0969 1.0984 1.1061 1.0936 1.0850 1.0888 1.0935 1.0982 1.0976
irintensity: 0.1903 2.0931 2.4865 4.1815 1.6416 0.1368 0.5426 3.7303 11.0746 8.0481 2.8850 5.9119 1.2759 3.0174 11.5279 4.9226 3.0393 26.5284 51.7045 1.3285 3.5128 4.9420 2.7219 15.5732 0.0822 0.2501 19.3581 40.9922 11.7643 38.4905 64.5116 14.3847 5.4681 14.5118 9.4874 4.6692 33.8976 27.9506 0.5214 0.6796 2.6528 0.1967 4.0132 12.8736 12.5390 0.9957 16.1329 12.4139 2.5682 3.4892 0.0659 0.9411 16.3139 3.8870 0.8827 3.2029 0.8520 0.9364 0.8117 7.1822 18.8806 3.7288 10.2613 7.3618 2.8030 11.7504 25.3562 32.8521 15.0671 3.9761 2.2974 1.8806 24.4177 37.2293 21.9587 9.0159 6.7742 1.6805 34.5049 9.1644 5.3499 30.3464 2.5943 8.2520 27.4121 24.9218 5.9547
temp: 298.150 k
press: 1.00000 atm
elementType: 16 8 8 7 6 6 6 6 6 6 6 6 6 6 6 6 1 1 1 1 1 1 1 1 1 1 1 1 1 1 1
symmnumber: 1
zpe: 638864.8 jmol-1
zpe.correction: 0.243331 hartree
zpe.thermalcorrener: 0.259928 hartree
zpe.thermalcorrenthalpy: 0.260872 hartree
zpe.thermalcorrgfe: 0.199198 hartree
zpe.sumelectzpe: -1068.156479 hartree
zpe.sumelectthermal: -1068.139882 hartree
zpe.sumelectthermalent: -1068.138937 hartree
zpe.sumelectthermalfe: -1068.200612 hartree
dipole: -2.2591 4.2101 -2.5618
dipole: 5.4214
quadrupole: -81.7987 -103.6248 -110.6823
quadrupole: 2.6926 3.9714 9.1095
quadrupole: 16.9033 -4.9229 -11.9804 2.6926 3.9714 9.1095
hfenergy: -1068.3998098 hartree
pointgroup: C01 [X(C12H15N1O2S1)]
dipole: 0.9210075 1.92378 0.0149923 debye
polarizability: 248.1584963|-18.4776202|140.9924681|4.3869193|-31.3124033|144.7938143 unknown
InChI: InChI=1S/C12H15NO2S/c1-10-8-13(12-6-4-3-5-7-12)16(14,15)9-11(10)2/h3-7H,8-9H2,1-2H3
charge 0 multiplicity 1
31 atoms
S  0.669498 -1.567178 0.393308
O  0.999556 -2.188138 -1.082883
O  -0.204414 -2.426151 1.465663
N  -0.041685 0.305261 0.314131
C  2.278675 -0.939491 1.227614
C  0.795787 0.955686 -0.732035
C  2.949127 0.160671 0.430391
C  2.29402 0.99873 -0.427812
C  -1.461883 0.358964 0.146292
C  4.446339 0.197339 0.703515
C  2.984957 2.069177 -1.256461
C  -2.100371 0.857767 -1.025906
C  -2.26032 -0.086378 1.238983
C  -3.507081 0.937816 -1.083878
C  -3.664702 -0.027974 1.158192
C  -4.295852 0.490823 0.001573
H  2.910289 -1.83978 1.323899
H  1.905534 -0.624899 2.216428
H  0.43084 1.999229 -0.814462
H  0.657458 0.488445 -1.736081
H  4.6483 0.154485 1.791527
H  4.928508 1.108459 0.318016
H  4.950255 -0.678214 0.247958
H  2.775584 3.07839 -0.8486
H  2.5999 2.058487 -2.29452
H  4.076711 1.94439 -1.310803
H  -1.509669 1.186189 -1.886792
H  -1.763376 -0.473922 2.132367
H  -3.989097 1.337715 -1.98299
H  -4.268484 -0.380313 2.001393
H  -5.388505 0.545513 -0.052827
