program: Gaussian 09
title: 000297878
version: EM64L-G09RevD.01
frameworkgroup: C1[X(C10H13Br2NO2S)]
method: RPBEPBE
basis: SDD
operation: Freq
keyword: #p
keyword: freq=noraman
keyword: PBEPBE/SDD
title: #p freq=noraman PBEPBE/SDD
converged: YES YES NO NO
title: Mulliken charges:
elementType: Br Br S O O N C C C C C C C C C C H H H H H H H H H H H H H
charge: -0.005198 -0.028498 0.957232 -0.532541 -0.522256 -0.509817 -0.329871 -0.049780 -0.412427 -0.239053 -0.239851 -0.646519 0.449087 -0.341125 -0.387231 -0.798128 0.260085 0.272175 0.336077 0.318171 0.283697 0.300042 0.355203 0.309368 0.245370 0.247673 0.244539 0.230488 0.233091
chargesum: 0.00000
title: Mulliken charges with hydrogens summed into heavy atoms:
elementType: Br Br S O O N C C C C C C C C C C
charge: -0.005198 -0.028498 0.957232 -0.532541 -0.522256 -0.173741 0.202389 -0.049780 -0.094255 0.044644 0.060191 0.018052 0.449087 -0.095756 -0.139559 -0.090010
polarizability: 2.25702798e+02 -3.43641010e+01 1.93115367e+02 1.82451535e+01 4.27474912e+00 1.20380165e+02
1716.lowfreq: -1.9721 -0.0015 -0.0013 -0.0012 3.7296 6.9716 18.0406 24.9482 28.2733
frequency: 18.0342 24.7906 28.2623 42.6215 49.6254 70.2145 110.1207 119.9354 146.0001 166.0459 182.7080 195.7534 214.7357 236.2992 266.6301 291.5524 306.2832 323.7198 363.2118 394.8580 405.8496 408.5663 441.7368 477.4529 512.0874 558.7612 583.5421 621.7211 646.8737 708.2325 728.2474 777.1775 804.2758 819.3582 827.2576 849.6216 893.7708 936.9109 961.8778 980.5221 983.7345 988.7803 997.2409 1039.0904 1050.1126 1054.5986 1121.1240 1128.2002 1157.0300 1167.2626 1186.9592 1218.7628 1238.6822 1251.0771 1299.0579 1318.6883 1351.2759 1370.4691 1381.5738 1392.4214 1400.8373 1425.5752 1456.2118 1470.7174 1473.9591 1474.9907 1593.9833 1596.0957 2982.4939 2988.5200 3041.6061 3044.3179 3063.5642 3078.7079 3093.7683 3136.4427 3139.6978 3156.0007 3161.1764 3166.4583 3405.8063
redmass: 8.7828 8.0720 4.1702 1.0420 9.3401 12.3733 4.9962 8.1811 7.2213 13.6506 5.1269 3.8184 6.0093 6.9011 5.9653 3.8021 3.6549 3.3841 3.1070 4.4828 4.2458 4.0335 2.9371 3.1343 3.1253 4.7611 5.1524 6.9344 3.1246 3.2201 2.1169 5.2009 10.2161 3.2939 1.3968 1.2478 1.6816 7.6392 1.3171 1.6214 1.5443 1.7867 2.8993 2.3673 1.5924 2.4909 1.3077 2.5843 1.2264 1.2667 1.1369 3.0453 1.1984 1.1675 1.2599 1.2102 1.2904 1.2183 5.2495 2.9855 1.2633 1.0713 1.0977 1.0661 1.5282 1.4514 6.6359 6.1966 1.0383 1.0597 1.0625 1.1011 1.0960 1.0861 1.0996 1.0894 1.0892 1.1094 1.0960 1.0966 1.0752
irintensity: 0.7077 0.6020 0.1834 0.4898 0.3017 0.2802 1.1608 4.3178 1.3403 0.9544 5.5512 4.6034 6.9660 5.4055 7.6824 9.5670 13.5684 2.9287 29.5787 15.1246 10.7819 13.2039 95.2162 31.4266 62.8081 27.1911 12.9174 0.0755 61.0611 0.7457 163.2880 12.3929 93.8744 2.8279 33.2702 5.5317 72.2685 60.6527 2.2016 17.3361 5.3443 2.0726 3.8498 7.4169 19.5739 27.6906 7.1539 25.6785 6.3228 6.6554 8.6720 5.9279 35.6838 6.9102 2.2943 3.7410 6.2815 13.3509 2.0728 10.5394 16.1304 14.7843 36.5944 15.4061 18.3777 17.5777 4.9586 9.5205 22.3296 9.1728 58.0572 2.4928 16.2946 4.3704 14.8739 12.1244 6.3978 6.4218 4.7002 6.4193 46.0334
temp: 298.150 k
press: 1.00000 atm
elementType: 35 35 16 8 8 7 6 6 6 6 6 6 6 6 6 6 1 1 1 1 1 1 1 1 1 1 1 1 1
symmnumber: 1
zpe: 559507.3 jmol-1
zpe.correction: 0.213105 hartree
zpe.thermalcorrener: 0.231516 hartree
zpe.thermalcorrenthalpy: 0.232460 hartree
zpe.thermalcorrgfe: 0.161956 hartree
zpe.sumelectzpe: -1017.656953 hartree
zpe.sumelectthermal: -1017.638542 hartree
zpe.sumelectthermalent: -1017.637597 hartree
zpe.sumelectthermalfe: -1017.708102 hartree
dipole: -3.5416 2.0687 -4.8109
dipole: 6.3220
quadrupole: -98.3038 -130.5343 -129.6140
quadrupole: -3.8036 6.6638 6.2340
quadrupole: 21.1802 -11.0503 -10.1300 -3.8036 6.6638 6.2340
hfenergy: -1017.8700578 hartree
pointgroup: C01 [X(C10H13Br2N1O2S1)]
dipole: 1.4772903 1.9472856 -0.4605519 debye
polarizability: 222.6573232|18.5755947|119.9968168|-32.5560543|-13.7066807|196.5441899 unknown
InChI: InChI=1S/C10H13Br2NO2S/c1-8-2-4-10(5-3-8)16(14,15)13-7-9(12)6-11/h2-5,9,13H,6-7H2,1H3
charge 0 multiplicity 1
29 atoms
Br -4.620628 0.719989 1.553584
Br -2.523049 0.753402 -2.718918
S  -0.483483 -1.193526 0.971916
O  -1.215179 -1.900206 -0.309257
O  -0.222879 -2.039286 2.334046
N  -1.361035 0.307315 1.595377
C  -1.869281 1.336505 0.677156
C  1.114581 -0.436588 0.338378
C  -3.279092 1.169464 0.051058
C  2.08503 -0.058515 1.281536
C  1.293081 -0.327196 -1.048895
C  -3.463258 0.101247 -1.021577
C  3.530384 0.615462 -0.602477
C  3.297251 0.472085 0.793548
C  2.516856 0.210471 -1.509364
C  4.851952 1.164433 -1.106752
H  -1.145572 1.467107 -0.151383
H  -1.864575 2.282391 1.25198
H  -2.025203 -0.011848 2.322267
H  -3.638051 2.14997 -0.302882
H  1.901715 -0.185512 2.35298
H  0.512286 -0.664131 -1.738949
H  -2.978254 -0.858954 -0.783031
H  -4.512965 -0.013803 -1.322708
H  4.073958 0.776459 1.504544
H  2.684127 0.310379 -2.587586
H  5.653032 0.406274 -1.013949
H  4.793129 1.456784 -2.168624
H  5.171621 2.04723 -0.524716
