program: Gaussian 09
title: 000297922
version: EM64L-G09RevD.01
frameworkgroup: C1[X(C21H27NO5)]
method: RPBEPBE
basis: SDD
operation: Freq
keyword: #p
keyword: freq=noraman
keyword: PBEPBE/SDD
title: #p freq=noraman PBEPBE/SDD
converged: YES YES NO NO
title: Mulliken charges:
elementType: O O O O O N C C C C C C C C C C C C C C C C C C C C C H H H H H H H H H H H H H H H H H H H H H H H H H H H
charge: -0.263911 -0.257035 -0.207815 -0.237984 -0.235347 -0.154803 -0.362723 -0.343826 -0.370315 0.498631 0.544357 0.148895 -0.509816 0.237265 0.254513 -0.828316 -0.385102 -0.471263 -0.410169 -0.367777 0.401459 -0.269683 -0.262690 -0.646078 -0.646606 -0.658830 -0.660969 0.272401 0.271901 0.329043 0.257172 0.239193 0.250029 0.238332 0.244875 0.225270 0.236488 0.233769 0.222391 0.236901 0.232261 0.217284 0.215691 0.233543 0.231326 0.215459 0.230989 0.234074 0.256884 0.230478 0.212915 0.205764 0.258964 0.232549
chargesum: 0.00000
title: Mulliken charges with hydrogens summed into heavy atoms:
elementType: O O O O O N C C C C C C C C C C C C C C C C C C C C C
charge: -0.263911 -0.257035 -0.207815 -0.237984 -0.235347 -0.154803 -0.090322 -0.071925 -0.041272 0.498631 0.544357 0.148895 -0.252644 0.237265 0.254513 -0.100763 -0.140227 -0.245993 -0.173682 -0.134008 0.401459 0.189608 0.186854 0.034482 0.033915 0.041446 0.036307
polarizability: 3.19555206e+02 -6.13457975e+00 2.50543144e+02 -2.48997152e+00 1.78915979e+01 2.04878379e+02
1716.lowfreq: -6.9524 -1.0329 -0.0008 -0.0007 -0.0005 6.4200 17.7980 25.6342 28.9167
frequency: 17.7061 25.6038 28.9005 30.0518 36.0530 43.8521 52.7299 62.2240 76.0976 82.5402 87.7650 93.1972 100.2037 116.4980 129.1426 138.9279 156.2893 163.6609 170.2382 190.0469 193.1697 200.6750 217.9519 226.2209 228.7245 238.9734 273.1520 292.5558 316.4059 318.6478 331.3971 375.0430 406.4554 411.6108 418.5174 432.0158 461.1540 478.3481 493.2987 510.8238 531.5292 543.4911 557.0560 570.3330 611.9282 637.5606 659.0549 692.2569 715.4226 724.1718 727.0821 742.5351 791.5506 806.7008 809.0369 813.2812 815.0080 819.4215 827.9046 847.3301 894.6535 916.0844 935.8720 944.6779 949.9619 961.8074 963.4602 991.3799 1002.5365 1007.6912 1010.8208 1024.5436 1047.7470 1056.2353 1085.5676 1096.7849 1098.7750 1109.4853 1110.1143 1111.4340 1120.0680 1140.6018 1155.0452 1157.9655 1158.6979 1166.6369 1205.4353 1219.0724 1231.6953 1242.0094 1255.0101 1264.3808 1274.7392 1275.7552 1276.9373 1289.8453 1310.1113 1325.3366 1337.6714 1351.0937 1354.1863 1356.9539 1362.1604 1388.0653 1395.2368 1395.3887 1395.9206 1427.1907 1438.6189 1454.4315 1457.5323 1457.9160 1459.0529 1462.4635 1462.6565 1462.8332 1462.9749 1473.4131 1482.9673 1483.8436 1494.0712 1507.2481 1529.6746 1564.5759 1571.5251 1631.7007 1634.3794 1639.8388 1651.0998 2933.2303 2941.8994 2969.0034 2988.0066 2994.1645 2994.7235 2997.2811 2999.9291 3025.8647 3027.5372 3030.3089 3042.0804 3043.0855 3090.5085 3090.5708 3092.7734 3093.7364 3095.1027 3096.3385 3102.4215 3109.0991 3119.5374 3121.4688 3133.5637 3138.6992 3161.0631 3165.3907
redmass: 4.1914 4.2039 4.0506 3.1820 5.6373 3.9884 3.0162 3.0115 2.8378 3.6111 3.0470 3.6006 5.7591 2.0384 2.1376 1.9135 3.5626 2.7122 2.4787 2.3050 2.0661 1.1314 2.4178 2.1278 1.9321 3.9060 3.1234 3.6021 3.5932 3.3015 3.7928 5.5387 3.6194 3.7054 2.9894 3.6816 3.9815 4.0541 4.0191 3.5829 4.2528 3.7479 4.0498 3.9926 4.6489 7.0746 5.6553 4.3427 4.1830 4.2036 4.1588 3.7979 1.8029 1.3986 2.6801 1.5297 1.6987 3.9834 2.2200 2.8533 1.6418 3.3854 1.6277 2.8949 2.6671 1.9987 1.8649 2.9463 2.6516 1.9652 2.5523 2.7379 1.7237 1.4904 3.8464 2.1656 2.2477 1.3150 1.2440 2.2582 2.7938 1.6971 2.6724 1.6915 1.7192 1.7713 1.2174 1.7131 1.4872 2.6783 1.4738 2.8183 1.4153 1.1472 1.1315 1.7096 1.5756 2.0035 1.4526 1.3933 1.3530 1.6151 2.8630 3.0848 1.2284 1.2325 1.2294 1.5359 1.8029 1.0511 1.0916 1.0839 1.1981 1.0682 1.0469 1.0553 1.0486 1.0464 1.0529 1.0534 1.0863 1.1027 2.5988 6.3144 10.1383 7.7193 6.1594 9.1241 7.1037 1.0371 1.0397 1.0383 1.0831 1.0363 1.0368 1.0987 1.1027 1.0835 1.0595 1.0594 1.0950 1.0816 1.0971 1.0975 1.0956 1.1035 1.1040 1.0991 1.0937 1.0893 1.1060 1.1048 1.0920 1.0873 1.0929 1.0942
irintensity: 0.2513 0.8673 0.5910 0.0696 2.4168 3.6190 0.5930 1.9165 0.3141 2.5797 1.8695 0.3017 0.8006 0.6613 1.1268 1.8122 0.5174 1.0155 0.1671 2.1953 3.8630 0.0493 2.5617 0.6713 0.9236 1.0953 2.5027 0.4816 3.0000 20.2654 13.9959 2.2833 1.0050 5.4802 0.3576 4.8278 2.6047 6.7565 2.0295 5.5346 0.4104 5.8454 9.1533 35.3979 4.5839 1.4765 5.2669 3.7273 2.5965 9.2132 4.1103 2.5072 0.4217 13.4002 5.2119 24.9543 32.3106 12.4986 1.4254 4.0117 23.1324 4.8749 1.3300 18.4053 7.9006 5.3708 0.1699 2.7061 1.0858 57.8677 46.4509 48.1373 12.0443 27.2555 290.5616 79.4733 5.4833 1.5171 0.3262 171.4596 41.5921 5.7806 23.8707 20.0745 34.9618 17.9915 55.5450 25.3571 32.7577 29.8466 10.5759 32.9962 28.2250 10.2433 9.6184 135.9537 77.2724 50.5407 18.4164 2.8537 5.4574 7.1709 129.9455 10.6874 26.2628 23.9899 24.8438 3.6176 0.4101 12.7798 11.5897 12.6643 12.1160 21.4936 11.9467 2.7743 3.3114 19.8891 20.4387 18.8080 1.8611 36.3025 251.9755 2.4755 220.1141 54.6471 189.1166 119.6447 138.7480 113.3241 97.6044 14.8260 8.3263 15.4656 24.1596 2.3721 91.7240 9.7196 29.0724 31.2331 11.6694 1.2841 51.8761 20.8759 4.1736 0.7845 1.0301 22.9740 52.6192 12.6922 28.0013 30.5757 12.3543 11.9337 23.5869 6.8847
temp: 298.150 k
press: 1.00000 atm
elementType: 8 8 8 8 8 7 6 6 6 6 6 6 6 6 6 6 6 6 6 6 6 6 6 6 6 6 6 1 1 1 1 1 1 1 1 1 1 1 1 1 1 1 1 1 1 1 1 1 1 1 1 1 1 1
symmnumber: 1
zpe: 1156804.3 jmol-1
zpe.correction: 0.440603 hartree
zpe.thermalcorrener: 0.469804 hartree
zpe.thermalcorrenthalpy: 0.470749 hartree
zpe.thermalcorrgfe: 0.377256 hartree
zpe.sumelectzpe: -1245.268206 hartree
zpe.sumelectthermal: -1245.239006 hartree
zpe.sumelectthermalent: -1245.238061 hartree
zpe.sumelectthermalfe: -1245.331554 hartree
dipole: 6.9425 2.9307 -0.0910
dipole: 7.5363
quadrupole: -149.8078 -138.5018 -156.8288
quadrupole: -12.1899 -3.6769 8.0946
quadrupole: -1.4284 9.8777 -8.4493 -12.1899 -3.6769 8.0946
hfenergy: -1245.70881 hartree
pointgroup: C01 [X(C21H27N1O5)]
dipole: -2.2880212 -1.8767099 0.1851022 debye
polarizability: 317.7003856|11.6549701|253.1776376|-4.6350215|-17.1326431|204.0987051 unknown
InChI: InChI=1S/C21H27NO5/c1-6-26-20(24)17-13(3)12-16(23)19(21(25)27-7-2)18(17)14-8-10-15(11-9-14)22(4)5/h8-12,17-19H,6-7H2,1-5H3
charge 0 multiplicity 1
54 atoms
O  0.373852 -3.44018 -0.506426
O  0.780103 3.04309 -1.284089
O  3.792245 1.811297 -0.648498
O  0.846847 -1.673956 -1.954516
O  1.083425 2.922444 1.027785
N  -4.994116 0.00332 0.654341
C  0.825095 -0.019019 0.630279
C  1.366734 -1.48011 0.475437
C  1.509366 0.941088 -0.381025
C  2.894789 -1.539269 0.482495
C  -0.702726 0.024952 0.601691
C  3.053377 0.834952 -0.322565
C  3.634738 -0.451647 0.105177
C  0.84523 -2.161131 -0.801115
C  1.107287 2.386338 -0.103443
C  3.522559 -2.841251 0.918735
C  -1.455177 0.217863 -0.58461
C  -1.428154 -0.168564 1.804034
C  -2.862717 0.212486 -0.57604
C  -2.834156 -0.181964 1.835853
C  -3.593767 0.008063 0.637238
C  -0.224391 -4.214129 -1.644391
C  0.503295 4.510291 -1.170941
C  -5.744003 0.224404 -0.586862
C  -5.711778 -0.168119 1.922317
C  -1.718099 -3.902187 -1.763384
C  1.814491 5.300896 -1.19447
H  1.1505 0.31036 1.6382
H  0.984565 -2.084884 1.318408
H  1.224966 0.682238 -1.416421
H  4.731041 -0.487553 0.111767
H  3.289742 -3.047252 1.982441
H  3.109229 -3.691615 0.343254
H  4.618434 -2.830587 0.800045
H  -0.942652 0.380973 -1.538857
H  -0.879121 -0.294897 2.746684
H  -3.392572 0.382013 -1.517725
H  -3.339678 -0.325812 2.794868
H  -0.037441 -5.264844 -1.370797
H  0.320598 -3.954003 -2.568664
H  -0.061016 4.688728 -0.238535
H  -0.129077 4.722434 -2.047845
H  -6.824138 0.167019 -0.37813
H  -5.534668 1.221027 -1.028636
H  -5.505859 -0.541882 -1.35288
H  -6.797096 -0.137289 1.736356
H  -5.477494 -1.141328 2.400897
H  -5.46823 0.634394 2.649272
H  -1.878112 -2.839302 -2.010139
H  -2.243591 -4.125476 -0.819243
H  -2.164169 -4.51857 -2.566038
H  1.59668 6.385397 -1.18511
H  2.43036 5.059848 -0.312634
H  2.397153 5.067206 -2.10154
