program: Gaussian 09
title: 000297920
version: EM64L-G09RevD.01
frameworkgroup: C1[X(C18H20O8)]
method: RPBEPBE
basis: SDD
operation: Freq
keyword: #pfreq=noraman
keyword: PBEPBE/SDD
title: #p freq=noraman PBEPBE/SDD
converged: YES YES NO NO
title: Mulliken charges:
elementType: O O O O O O O O C C C C C C C C C C C C C C C C C C H H H H H H H H H H H H H H H H H H H H
charge: -0.286533 -0.264585 -0.263072 -0.397671 -0.210197 -0.192712 -0.220726 -0.227250 -0.284893 -0.313962 -0.335492 0.518828 0.228421 0.210548 -0.562269 0.229976 -0.339874 0.155157 0.198474 0.151228 -0.379727 -0.782221 -0.785468 -0.206145 -0.264313 -0.667138 0.311208 0.313968 0.319283 0.301251 0.239523 0.254043 0.250175 0.277913 0.232601 0.254806 0.257026 0.256672 0.239746 0.232263 0.386438 0.236325 0.225690 0.261392 0.219627 0.221665
chargesum: 0.00000
title: Mulliken charges with hydrogens summed into heavy atoms:
elementType: O O O O O O O O C C C C C C C C C C C C C C C C C C
charge: -0.286533 -0.264585 -0.263072 -0.011233 -0.210197 -0.192712 -0.220726 -0.227250 0.026315 0.000006 -0.016209 0.518828 0.228421 0.210548 -0.261018 0.229976 -0.100351 0.155157 0.198474 0.151228 -0.125684 -0.021532 -0.016963 0.265864 0.197702 0.035545
polarizability: 2.56617206e+02 2.45516777e-01 1.79962141e+02 -6.97977458e+00 6.41109023e+00 2.09365583e+02
1716.lowfreq: -6.4458 -3.4400 -0.0006 0.0007 0.0011 2.9798 19.6906 29.1009 35.9719
frequency: 19.3385 28.9637 35.9530 44.3699 53.9093 58.5589 62.1314 65.8126 71.8150 83.8791 87.5781 96.7082 103.2141 111.0947 133.9085 147.7274 163.1019 172.5341 189.2393 201.5853 214.2727 223.7068 239.8414 257.6559 271.2796 307.2864 330.6904 345.3490 378.5834 399.8285 414.0900 432.6444 450.1336 463.8640 478.9931 496.0132 546.4144 564.0248 575.5541 598.4540 616.5149 622.1854 636.1397 663.6320 676.8594 682.8130 718.7646 723.2337 760.1172 777.9860 786.4656 806.4516 817.1489 826.0630 828.8909 842.9486 878.3225 898.6509 905.2016 929.8289 941.3120 953.5955 968.2578 974.8215 1001.1943 1010.4046 1019.1269 1036.1585 1059.3660 1073.0802 1074.8522 1093.5463 1095.9677 1106.7901 1128.8377 1137.6578 1154.8052 1170.3322 1178.5987 1193.4728 1202.6532 1234.5167 1239.2565 1247.1749 1278.7737 1281.1036 1294.3945 1305.4933 1320.5103 1333.3515 1356.6107 1363.5355 1370.0021 1375.4970 1392.1960 1407.1006 1441.6635 1442.4649 1445.7594 1450.0735 1452.1050 1456.2734 1463.9528 1475.5772 1484.7652 1485.7917 1611.7786 1624.8143 1628.1320 1631.9508 1638.4052 1655.9341 2987.0897 2987.8760 2991.5067 2994.3844 2996.7144 3008.2509 3030.5396 3044.6837 3074.6000 3076.2029 3083.4621 3094.6035 3110.0176 3119.0937 3124.8564 3126.0518 3155.0804 3178.9644 3184.5460 3517.3035
redmass: 5.0606 4.3336 5.2781 4.3998 4.5783 4.2778 4.4489 6.9570 3.9061 5.6906 1.2747 2.5955 4.7700 4.3314 2.0867 2.0925 4.5368 4.0999 4.0078 3.8607 3.4400 4.4774 2.4505 3.2429 4.1849 4.6141 3.8919 4.8411 5.5966 5.3150 3.8712 3.4369 4.0235 3.8702 3.7041 3.5233 5.3190 2.1051 3.8601 2.7318 3.2597 5.1299 4.6597 3.7746 8.7057 4.4178 5.1998 5.1972 2.6145 6.1516 3.9303 1.5908 1.8539 2.7087 3.4665 4.1945 4.9151 3.4168 1.4697 3.0430 1.3863 2.1879 2.0752 5.2489 1.9673 2.1502 2.4947 2.4228 3.4911 1.4963 3.7833 2.2208 2.2110 2.9387 1.0864 1.5208 1.6562 1.7683 2.3691 1.5909 2.1077 1.4722 2.4758 2.0193 1.4694 1.1149 1.5529 2.0210 1.6896 1.4464 1.2888 1.2582 1.2294 1.2219 1.2329 2.9418 1.1950 2.7576 1.0691 1.0665 1.0603 1.0935 1.0436 1.9866 1.0575 1.4002 7.8575 9.0508 8.0550 9.0118 9.1596 8.6299 1.0387 1.0412 1.0362 1.0734 1.0615 1.0815 1.0593 1.0834 1.0933 1.0963 1.0980 1.1029 1.1095 1.1061 1.1007 1.1016 1.0878 1.0956 1.0939 1.0642
irintensity: 0.0873 0.6864 0.1103 3.0654 0.1477 1.6220 0.5281 1.4232 5.6838 0.3892 1.2723 12.3469 2.3995 0.7501 2.3221 1.3327 5.2798 0.3520 2.7622 2.3377 1.6404 2.0823 3.2159 1.1318 2.9766 4.0200 11.8055 1.0144 2.1273 6.6401 0.8174 2.0525 8.1005 8.1835 8.4097 18.5643 5.6111 65.8434 27.0857 46.2704 72.0254 8.6319 3.0665 40.3714 1.7799 6.9408 2.4901 9.6285 2.2220 16.2722 16.4280 26.1099 11.0148 8.6631 24.4987 16.4631 2.1791 21.6220 20.8947 15.8171 0.5514 24.3320 6.5107 158.6968 39.7006 17.4970 101.4568 27.1026 16.2938 7.2447 95.0982 142.5347 47.4222 104.5151 0.5855 14.2663 10.1457 81.1765 76.2211 26.9550 67.0318 69.2207 251.4626 14.2996 29.7076 2.6376 61.3907 10.7157 18.9444 27.6409 2.1478 0.5966 74.8140 56.5783 19.4000 3.5911 35.7908 50.4176 27.7910 22.5615 17.8722 14.2654 12.3593 112.7050 20.3350 52.2992 13.8304 243.8259 37.3915 92.9565 136.7455 47.1425 0.3695 4.8200 12.7397 19.5683 134.1889 13.1694 31.4719 1.3164 5.5318 6.7955 42.3586 4.6929 31.8024 27.3032 11.7312 10.3735 8.9875 2.5700 3.4127 35.0786
temp: 298.150 k
press: 1.00000 atm
elementType: 8 8 8 8 8 8 8 8 6 6 6 6 6 6 6 6 6 6 6 6 6 6 6 6 6 6 1 1 1 1 1 1 1 1 1 1 1 1 1 1 1 1 1 1 1 1
symmnumber: 1
zpe: 920932.8 jmol-1
zpe.correction: 0.350765 hartree
zpe.thermalcorrener: 0.377777 hartree
zpe.thermalcorrenthalpy: 0.378721 hartree
zpe.thermalcorrgfe: 0.290770 hartree
zpe.sumelectzpe: -1297.744208 hartree
zpe.sumelectthermal: -1297.717196 hartree
zpe.sumelectthermalent: -1297.716252 hartree
zpe.sumelectthermalfe: -1297.804202 hartree
dipole: -1.7467 -0.2668 3.3720
dipole: 3.8069
quadrupole: -135.7265 -140.1996 -160.1743
quadrupole: 3.0860 -8.5667 -6.5851
quadrupole: 9.6403 5.1672 -14.8075 3.0860 -8.5667 -6.5851
hfenergy: -1298.0949727 hartree
pointgroup: C01 [X(C18H20O8)]
dipole: -0.5933085 0.4960675 -1.2826481 debye
polarizability: 255.2319583|-7.2376654|179.3886247|8.6905789|-2.7421192|211.3243469 unknown
InChI: InChI=1S/C18H20O8/c1-4-24-18(23)15(10(3)20)16(14(9(2)19)17(21)22)11-5-6-12-13(7-11)26-8-25-12/h5-7,14-16,21H,4,8H2,1-3H3
charge 0 multiplicity 1
46 atoms
O  -2.013612 1.978495 -0.958321
O  4.061919 -1.06634 1.313991
O  4.620155 -0.469755 -0.940549
O  -0.94547 -3.320165 -0.256567
O  -0.412491 0.23586 3.222582
O  -3.655368 -1.119969 1.199666
O  -0.233016 2.885243 0.242377
O  -1.268502 -2.565831 -2.430507
C  -0.922012 -0.541466 0.560526
C  -1.420821 0.86055 1.08227
C  -1.890191 -1.114787 -0.517483
C  0.537536 -0.507523 0.088649
C  -0.935887 1.144532 2.528814
C  -3.30971 -1.448307 0.037063
C  1.565977 -0.823625 1.027098
C  -1.118996 2.01094 0.124882
C  0.881847 -0.16061 -1.243476
C  -1.333427 -2.36111 -1.199438
C  2.884612 -0.760233 0.580333
C  3.215978 -0.409903 -0.746512
C  2.231055 -0.11001 -1.687437
C  -1.195036 2.527725 3.096897
C  -4.256925 -2.170732 -0.905328
C  5.182336 -0.671212 0.42285
C  -1.878743 3.080056 -1.969855
C  -0.832338 2.744004 -3.03467
H  -0.981835 -1.198934 1.446301
H  -2.523785 0.789285 1.172638
H  -2.053312 -0.376615 -1.326905
H  1.317673 -1.088866 2.057353
H  0.096258 0.070382 -1.969072
H  2.485733 0.145126 -2.718997
H  -1.11485 2.498091 4.194264
H  -0.442075 3.228307 2.690818
H  -2.187534 2.911036 2.796843
H  -4.008011 -3.249924 -0.918815
H  -5.293307 -2.060663 -0.550904
H  -4.159982 -1.806639 -1.94276
H  5.919909 -1.487321 0.388896
H  5.608535 0.285706 0.780151
H  -0.553203 -4.107239 -0.722998
H  -1.615289 4.006834 -1.43078
H  -2.893013 3.159976 -2.392695
H  0.172346 2.66695 -2.58736
H  -1.074015 1.797742 -3.550214
H  -0.811913 3.548438 -3.793221
