program: Gaussian 09
title: 000297872
version: EM64L-G09RevD.01
frameworkgroup: C1[X(C14H17N3O6)]
method: RPBEPBE
basis: SDD
operation: Freq
keyword: #p
keyword: freq=noraman
keyword: PBEPBE/SDD
title: #p freq=noraman PBEPBE/SDD
converged: YES YES NO NO
title: Mulliken charges:
elementType: O O O O O O N N N C C C C C C C C C C C C C C H H H H H H H H H H H H H H H H H
charge: -0.274012 -0.293988 -0.260863 -0.375637 -0.447063 -0.260565 -0.336227 -0.325671 -0.339661 -0.530904 -0.535887 0.485097 -0.488785 0.303065 0.256671 -0.379961 -0.368453 0.378736 -0.439778 -0.228564 -0.244613 -0.233961 0.214073 0.263445 0.258138 0.262240 0.269236 0.226849 0.254079 0.320118 0.344716 0.231654 0.284055 0.350704 0.279266 0.252736 0.226776 0.248572 0.229719 0.424647
chargesum: 0.00000
title: Mulliken charges with hydrogens summed into heavy atoms:
elementType: O O O O O O N N N C C C C C C C C C C C C C C
charge: -0.274012 -0.293988 -0.260863 -0.375637 -0.022417 -0.260565 -0.016108 0.019045 0.011043 -0.009321 -0.004411 0.485097 -0.007857 0.303065 0.256671 -0.148307 -0.084398 0.378736 0.092224 -0.001788 0.003959 -0.004242 0.214073
polarizability: 2.26496409e+02 -4.34145301e+00 1.91826238e+02 2.12889928e+01 -5.61527444e+00 1.40938482e+02
1716.lowfreq: -9.3445 -4.7912 -0.0010 -0.0009 -0.0006 3.2897 14.0756 22.0258 39.7022
frequency: 13.8727 21.9638 39.6991 51.2277 59.5852 69.6865 74.7564 86.6795 100.4489 111.9977 125.7383 153.0429 164.7501 205.5331 210.0573 244.9674 257.0380 263.6103 287.5108 304.7680 334.6397 356.2054 382.4392 403.0201 406.8935 456.8766 482.8463 530.2173 543.8563 546.5003 565.8843 585.4840 596.5431 612.3046 616.6787 648.6671 668.9466 682.4655 706.7684 713.7153 737.7370 759.7585 766.6290 817.1438 826.0395 835.9088 850.2989 863.7579 871.5778 903.6848 941.9609 950.2518 974.9413 984.7197 986.9374 990.3910 1010.3805 1011.8640 1021.6495 1023.9765 1036.0069 1093.7061 1104.1637 1152.7334 1160.8452 1172.6469 1189.3010 1208.5679 1222.4091 1227.2836 1231.8785 1234.8358 1245.0902 1264.8632 1276.4261 1317.3822 1323.0028 1328.6349 1336.6918 1349.4013 1362.1308 1386.5964 1441.2382 1441.3830 1442.0424 1443.5005 1467.8361 1484.0234 1490.2886 1514.0112 1532.4038 1594.3253 1608.8367 1612.9472 1619.6647 1637.5417 1645.2881 2900.7813 3003.3980 3018.5665 3041.8493 3047.5109 3068.9113 3089.8151 3118.0937 3121.3082 3124.9515 3131.6536 3144.2127 3153.0109 3168.5403 3419.3632 3535.2238 3573.3882
redmass: 5.4955 5.5963 5.8390 6.3938 4.2335 8.2689 8.7787 6.2558 9.1721 9.1840 5.4536 5.9406 5.7148 4.9104 3.9482 5.4586 3.4071 4.4327 4.2743 6.8101 3.5239 3.7749 2.7532 3.6036 2.8797 3.0849 3.4864 3.2815 3.3375 3.6922 1.5160 1.4828 4.1850 3.3417 5.9340 4.1191 4.7865 5.4282 2.2185 4.2260 3.7764 2.0717 1.6250 3.8874 4.0323 4.6078 3.3565 1.2487 2.7998 3.3128 1.4544 1.2917 1.8158 2.4466 1.4033 5.4187 1.3665 3.3580 2.5558 2.1327 3.6231 1.5169 4.1312 3.1157 3.0556 1.0585 1.1247 1.5006 2.7100 1.6615 1.1754 1.2021 1.7788 1.4546 1.9107 1.3091 1.3123 1.2617 1.4174 1.3115 1.6662 8.2567 1.1063 2.0586 1.1533 1.0844 1.1337 2.3104 1.8196 1.9478 1.6597 6.0218 7.2309 6.2203 6.9976 8.0577 5.6219 1.0748 1.0605 1.0603 1.0606 1.0579 1.1012 1.1020 1.0901 1.1058 1.1050 1.0886 1.0912 1.0968 1.1010 1.0804 1.0777 1.0775
irintensity: 0.0245 0.9197 1.0192 0.8619 1.3937 3.0493 2.4258 11.1627 8.0352 0.8532 8.9983 1.4999 14.7401 7.6817 11.4815 2.6858 19.0847 9.5727 14.8054 11.4476 3.2925 2.3671 53.9429 25.8293 0.6337 3.6995 20.1781 10.2481 21.8305 30.3241 43.3580 114.4314 11.2280 43.1672 2.1923 6.2926 9.7483 21.9970 32.0475 97.4022 20.0616 76.6302 112.3943 17.6127 19.2029 48.3630 8.1059 1.7645 33.0088 164.7248 3.2457 298.5335 3.1408 0.9549 1.1447 2.5836 2.0038 21.1138 12.4802 1.4517 37.6153 9.8976 3.4831 88.4683 205.7585 1.5504 1.1745 10.4765 62.6874 193.4523 8.8636 39.2366 24.7787 150.7024 39.2670 2.9686 6.3123 1.0331 7.4988 26.2290 9.8250 2.4533 9.8719 12.8842 47.6218 29.7524 14.1175 2.5921 124.2970 313.1448 157.4021 6.4159 264.8010 20.3892 227.7918 202.5396 310.7537 1089.7608 26.5884 26.0874 17.9565 28.8141 2.7235 4.3637 1.9775 7.6516 5.6466 7.8165 23.6641 18.4583 16.7974 88.9592 29.1768 53.5959
temp: 298.150 k
press: 1.00000 atm
elementType: 8 8 8 8 8 8 7 7 7 6 6 6 6 6 6 6 6 6 6 6 6 6 6 1 1 1 1 1 1 1 1 1 1 1 1 1 1 1 1 1
symmnumber: 1
zpe: 811534.7 jmol-1
zpe.correction: 0.309097 hartree
zpe.thermalcorrener: 0.331043 hartree
zpe.thermalcorrenthalpy: 0.331987 hartree
zpe.thermalcorrgfe: 0.255225 hartree
zpe.sumelectzpe: -1157.635935 hartree
zpe.sumelectthermal: -1157.613990 hartree
zpe.sumelectthermalent: -1157.613046 hartree
zpe.sumelectthermalfe: -1157.689808 hartree
dipole: 0.9793 5.4341 2.2021
dipole: 5.9446
quadrupole: -132.2485 -120.9052 -137.8308
quadrupole: -12.5762 -1.8284 -6.6587
quadrupole: -1.9204 9.4230 -7.5026 -12.5762 -1.8284 -6.6587
hfenergy: -1157.9450327 hartree
pointgroup: C01 [X(C14H17N3O6)]
dipole: -0.8176851 2.1786125 0.2344516 debye
polarizability: 229.6233941|8.7956224|178.5508839|4.8258653|25.8159288|151.0868509 unknown
InChI: InChI=1S/C14H17N3O6/c18-11(16-8-13(20)21)6-15-12(19)7-17-14(22)23-9-10-4-2-1-3-5-10/h1-5,15-17,20H,6-9H2
charge 0 multiplicity 1
40 atoms
O  -2.282871 1.489922 1.543692
O  1.005506 1.915299 -1.386149
O  4.983075 -0.413676 -1.02517
O  -0.26992 0.409297 2.077781
O  1.68148 -0.658172 0.774172
O  0.545778 -2.594397 0.154849
N  3.101019 2.248504 -0.428394
N  -0.325937 2.514872 1.036197
N  2.745006 -0.479856 -1.721276
C  3.840832 1.702174 -1.587762
C  1.117315 2.695118 0.963236
C  -3.45156 -0.576625 0.772293
C  -3.063935 0.258411 1.968677
C  1.722773 2.244739 -0.390604
C  3.936217 0.163978 -1.44345
C  -4.662124 -0.31483 0.079926
C  -2.608096 -1.625984 0.32523
C  -0.904279 1.392024 1.573579
C  2.460459 -1.816327 -1.194861
C  -5.023096 -1.085304 -1.046856
C  -2.966875 -2.393926 -0.804767
C  -4.174056 -2.126694 -1.491749
C  1.46149 -1.754463 -0.025486
H  3.301698 1.990979 -2.505736
H  4.857968 2.121332 -1.604107
H  1.360076 3.760944 1.132864
H  1.581162 2.108803 1.776814
H  -3.936792 0.699939 2.473836
H  -2.436224 -0.297317 2.684373
H  3.622094 2.35634 0.445219
H  -0.94051 3.151816 0.527751
H  -5.319445 0.493837 0.423477
H  -1.666551 -1.846457 0.840431
H  1.94416 0.116582 -1.973117
H  3.418145 -2.246111 -0.846639
H  2.03513 -2.483138 -1.962875
H  -5.960889 -0.878496 -1.574532
H  -2.300151 -3.195304 -1.13967
H  -4.453484 -2.72559 -2.36614
H  0.912811 -0.416143 1.414246
