program: Gaussian 09
title: 000297845
version: EM64L-G09RevD.01
frameworkgroup: C1[X(C14H18N2O5)]
method: RPBEPBE
basis: SDD
operation: Freq
keyword: #p
keyword: freq=noraman
keyword: PBEPBE/SDD
title: #p freq=noraman PBEPBE/SDD
converged: YES YES NO NO
title: Mulliken charges:
elementType: O O O O O N N C C C C C C C C C C C C C C H H H H H H H H H H H H H H H H H H
charge: -0.284020 -0.295117 -0.263620 -0.226074 -0.313858 -0.136744 -0.379243 -0.474849 -0.444434 0.233264 -0.621944 0.468395 -0.476934 0.288266 0.296965 -0.368283 -0.387901 -0.230261 -0.226359 -0.234474 -0.498334 0.260677 0.256418 0.248305 0.291748 0.228735 0.281254 0.257823 0.368221 0.218651 0.240602 0.273513 0.233030 0.224896 0.225766 0.227395 0.246843 0.248010 0.243669
chargesum: 0.00000
title: Mulliken charges with hydrogens summed into heavy atoms:
elementType: O O O O O N N C C C C C C C C C C C C C C
charge: -0.284020 -0.295117 -0.263620 -0.226074 -0.313858 -0.136744 -0.011023 0.042246 0.095620 0.233264 0.145868 0.468395 -0.017681 0.288266 0.296965 -0.094770 -0.154871 -0.005365 -0.000593 -0.007079 0.240189
polarizability: 2.16021360e+02 6.81895346e+00 1.81622509e+02 1.95051292e+01 -8.21614310e+00 1.39515766e+02
1716.lowfreq: -10.8169 -5.8059 -4.0911 -0.0005 -0.0004 0.0005 5.1522 13.0371 18.7332
frequency: -3.5947 12.6572 18.6317 25.0924 38.7270 62.1209 66.8875 76.6753 89.0795 94.5202 126.5180 131.1043 150.2727 170.4241 197.5790 198.3020 211.8321 253.1867 264.8380 306.3420 310.6506 350.0151 361.0791 399.1242 403.9343 438.0668 478.8295 543.6794 551.4977 553.0246 601.7623 612.4283 617.7484 648.0870 685.5636 699.4002 704.8352 728.0901 758.0590 781.2366 800.4541 815.5477 857.4433 885.3126 928.6954 934.5139 958.0848 962.7132 980.4295 985.0830 988.3263 990.0051 994.1436 998.9781 1026.9188 1083.6799 1090.2659 1112.5874 1127.1104 1138.3025 1149.3436 1172.2391 1174.9396 1188.0325 1203.7518 1216.8072 1221.2168 1231.5601 1241.0359 1252.2651 1319.2811 1329.4621 1333.4913 1351.2737 1385.4395 1405.0274 1420.8998 1424.2071 1441.9668 1452.8590 1457.9914 1461.5207 1462.6274 1470.4504 1484.0418 1484.2399 1487.3110 1495.2917 1594.2962 1598.4087 1614.6746 1643.5821 1651.7635 2959.1314 2984.5330 3010.8644 3014.0646 3032.2462 3035.3497 3069.2072 3105.5237 3116.0709 3117.2173 3118.7835 3125.8244 3128.8965 3138.4871 3149.4153 3159.8514 3163.1058 3496.1176
redmass: 4.8269 4.9553 5.0325 4.9039 4.9475 5.0664 5.6786 1.1512 5.4586 5.9055 3.4235 1.1268 4.1204 4.8359 3.6606 3.8659 4.9325 3.7990 6.2018 5.7372 4.5570 2.9962 3.7126 3.4454 2.8104 2.0753 3.8307 4.7177 3.2774 5.1423 4.3748 4.6766 6.0062 5.6752 1.1168 5.4031 2.1535 6.1815 2.2119 4.5348 5.9190 3.4582 1.2488 5.7989 2.9030 1.6849 3.4386 2.8003 1.4710 2.3226 2.6261 2.9798 3.2655 1.3533 2.2108 2.0461 1.5268 1.2682 1.3059 4.2176 1.4350 1.0544 2.5949 1.1251 1.8907 3.4917 2.8861 1.1713 1.1636 1.8080 1.5049 1.2562 1.2845 1.2791 7.9329 1.8520 1.2053 1.3567 2.1794 1.0501 1.2674 1.0628 1.0953 1.9028 1.0789 2.2438 1.0995 1.1786 6.1098 6.5789 6.0827 9.0857 9.5601 1.0626 1.0357 1.0297 1.0966 1.0586 1.0629 1.1014 1.1071 1.1051 1.1016 1.0858 1.0876 1.0991 1.0923 1.0964 1.1052 1.1016 1.0774
irintensity: 0.2983 0.6307 1.4500 0.4626 1.2821 0.8899 0.4934 0.4008 6.3022 4.4071 1.6746 0.0336 6.4883 2.3651 10.1648 3.1818 8.3180 10.3191 10.9786 5.4733 13.4694 8.0451 25.4976 3.3333 0.1092 3.7102 12.6250 9.2682 4.5738 10.1168 24.0274 6.6220 0.1471 9.8058 110.5420 15.8081 67.0457 8.1367 50.2430 17.0841 5.9624 9.2813 0.2418 22.4348 37.7590 3.7096 20.7272 83.5106 8.3289 42.1363 38.4190 5.5137 166.7812 0.9594 3.5522 66.4487 16.2518 0.0640 0.2165 17.7628 5.0074 0.0585 343.0370 0.1078 15.8722 46.1950 27.7910 3.0741 8.6966 45.4232 49.5584 2.8361 6.6107 9.4678 0.5951 130.0017 36.2535 95.9331 10.2814 17.2472 87.1388 18.7441 25.1299 448.0314 31.3245 39.2093 68.0073 9.4411 4.6915 238.8759 0.7360 264.6420 215.0723 46.5149 42.5152 20.8295 8.7106 38.8760 19.4352 19.7276 6.9574 21.2627 4.8349 4.4357 2.3123 0.7705 21.2626 25.6044 9.7788 24.3550 144.6955
temp: 298.150 k
press: 1.00000 atm
elementType: 8 8 8 8 8 7 7 6 6 6 6 6 6 6 6 6 6 6 6 6 6 1 1 1 1 1 1 1 1 1 1 1 1 1 1 1 1 1 1
symmnumber: 1
zpe: 808235.9 jmol-1
zpe.correction: 0.307841 hartree
zpe.thermalcorrener: 0.328950 hartree
zpe.thermalcorrenthalpy: 0.329895 hartree
zpe.thermalcorrgfe: 0.253474 hartree
zpe.sumelectzpe: -1028.349616 hartree
zpe.sumelectthermal: -1028.328506 hartree
zpe.sumelectthermalent: -1028.327562 hartree
zpe.sumelectthermalfe: -1028.403983 hartree
dipole: -1.8431 2.0926 -0.6328
dipole: 2.8595
quadrupole: -111.9819 -113.9339 -126.6949
quadrupole: 1.8774 12.4293 4.6318
quadrupole: 5.5550 3.6030 -9.1580 1.8774 12.4293 4.6318
hfenergy: -1028.6574566 hartree
pointgroup: C01 [X(C14H18N2O5)]
dipole: 0.777039 -0.7755555 -0.2457177 debye
polarizability: 213.8377305|8.7820932|183.1363178|-22.1012853|5.3315349|140.1855862 unknown
InChI: InChI=1S/C14H18N2O5/c1-16(9-13(18)20-2)12(17)8-15-14(19)21-10-11-6-4-3-5-7-11/h3-7,15H,8-10H2,1-2H3
charge 0 multiplicity 1
39 atoms
O  -2.138242 1.705642 -0.169031
O  2.121505 2.520902 1.294614
O  3.383479 -1.752734 -0.39172
O  5.528766 -1.292425 0.405427
O  -1.046235 0.33044 -1.759019
N  3.82024 1.408793 0.153644
N  0.125847 1.519566 -0.119445
C  4.274464 0.435134 -0.858569
C  1.441368 1.070651 -0.55218
C  2.48517 1.721816 0.374697
C  4.861471 1.988433 1.029133
C  -4.025901 0.073665 -0.051133
C  -3.458914 1.29255 -0.748543
C  4.504101 -0.944079 -0.221857
C  -1.008788 1.11135 -0.765721
C  -3.678373 -1.230947 -0.489736
C  -4.913734 0.220222 1.044547
C  -4.209024 -2.366682 0.160872
C  -5.445275 -0.915202 1.696215
C  -5.093961 -2.212096 1.254336
C  3.443733 -3.096875 0.243676
H  3.54905 0.351219 -1.680283
H  5.23889 0.779969 -1.270547
H  1.625491 1.364218 -1.60689
H  1.522238 -0.033207 -0.514383
H  5.554796 2.61343 0.435932
H  4.363526 2.612666 1.785464
H  5.437499 1.187572 1.52585
H  0.095165 2.165026 0.677522
H  -4.087381 2.183107 -0.588978
H  -3.312738 1.109713 -1.827326
H  -2.98293 -1.339695 -1.329742
H  -5.1854 1.225993 1.388415
H  -3.937315 -3.370328 -0.185471
H  -6.131607 -0.790706 2.541389
H  -5.508126 -3.094029 1.756341
H  4.304567 -3.661273 -0.150844
H  3.543068 -2.99157 1.336619
H  2.493011 -3.575427 -0.026474
