program: Gaussian 09
title: 000297832
version: EM64L-G09RevD.01
frameworkgroup: C1[X(C16H21N3O6)]
method: RPBEPBE
basis: SDD
operation: Freq
keyword: #p
keyword: freq=noraman
keyword: PBEPBE/SDD
title: #p freq=noraman PBEPBE/SDD
converged: YES YES NO NO
title: Mulliken charges:
elementType: O O O O O O N N N C C C C C C C C C C C C C C C C H H H H H H H H H H H H H H H H H H H H H
charge: -0.251354 -0.285133 -0.295613 -0.250440 -0.294314 -0.315533 -0.391712 -0.357357 -0.366424 -0.115499 -0.456387 -0.671462 0.217371 0.210445 -0.459823 0.211479 0.468816 -0.477661 -0.389859 -0.367826 0.313919 -0.226337 -0.229082 -0.234632 -0.497145 0.282418 0.351386 0.265418 0.265460 0.267545 0.241640 0.216053 0.357125 0.258497 0.257858 0.241308 0.217501 0.366766 0.232135 0.274486 0.224950 0.225731 0.226986 0.241857 0.248905 0.247536
chargesum: 0.00000
title: Mulliken charges with hydrogens summed into heavy atoms:
elementType: O O O O O O N N N C C C C C C C C C C C C C C C C
charge: -0.251354 -0.285133 -0.295613 -0.250440 -0.294314 -0.315533 -0.040326 -0.000232 0.000342 0.166919 0.074490 0.053777 0.217371 0.210445 0.056532 0.211479 0.468816 -0.018851 -0.157724 -0.093340 0.313919 -0.001386 -0.003351 -0.007647 0.241153
polarizability: 2.79426569e+02 -1.43234044e+01 1.65863803e+02 1.19039746e+01 -2.62096475e+00 1.93767271e+02
1716.lowfreq: -12.3839 -2.6332 -1.0480 -0.0012 -0.0004 0.0003 5.9051 16.3311 19.7139
frequency: 4.4652 15.4330 19.7050 26.7624 31.3928 45.6149 51.7143 53.3039 75.2573 81.7092 93.5902 100.6502 106.3013 126.9502 133.3252 143.0566 154.8494 174.5568 179.3295 205.7758 221.7434 230.1438 269.4139 277.8109 290.8259 309.5583 317.6516 354.0876 380.9839 403.8162 408.8875 472.5263 522.6189 551.1908 564.1464 580.5812 596.9673 604.2037 617.3618 622.4016 654.0953 664.2392 678.0885 696.6373 698.8370 705.1719 705.7521 727.7648 759.3581 811.3033 815.1722 857.7747 875.9159 890.2883 932.0954 936.2841 953.2983 958.6680 965.1760 980.8463 984.4475 987.1776 991.3629 991.8049 999.3613 1026.6498 1059.6563 1081.3600 1089.9715 1098.2181 1114.6856 1140.3258 1152.5467 1160.6191 1172.3090 1184.5168 1188.0043 1202.0655 1207.6688 1208.2055 1219.7640 1224.1746 1234.1993 1240.8546 1290.3077 1308.7546 1326.9920 1329.7542 1348.1074 1355.7052 1384.6521 1385.2663 1425.1874 1441.7776 1454.5765 1457.6119 1462.1785 1464.3684 1469.2559 1473.2693 1477.4077 1479.7147 1484.1842 1496.2700 1506.8106 1594.1586 1604.3568 1614.6353 1620.9936 1634.2630 1654.2391 2971.4928 2979.3058 3002.3728 3011.7593 3012.7122 3021.6425 3022.1910 3031.5803 3104.8148 3108.0563 3117.3683 3118.2325 3118.3961 3126.0696 3138.8231 3150.1463 3160.1955 3163.1418 3444.2970 3481.4255 3492.4752
redmass: 5.9964 4.7760 5.3730 5.1697 4.3187 5.6337 4.8620 5.4753 5.3409 4.7553 2.0268 2.0969 4.4136 4.8604 4.0873 3.3234 5.4399 3.3095 2.9722 3.3137 6.1829 1.2055 5.3761 6.2080 4.0764 9.3139 4.9697 2.7483 3.5718 2.8184 3.4780 3.8634 4.1274 2.9105 3.9926 3.4056 5.4951 4.4984 6.4185 5.6919 1.2016 5.3875 1.1180 1.2158 4.4355 2.1561 3.8299 4.2103 2.1512 4.0669 3.4743 1.2520 5.5151 3.3094 1.9719 3.2254 2.7675 3.0827 2.9670 1.4891 1.9848 3.0393 2.1923 4.0695 1.3535 2.2077 1.7071 3.6039 1.5235 3.4876 1.2698 3.8384 1.4425 3.6513 1.0542 2.4223 1.1184 1.0873 1.1014 1.8374 2.9108 1.5605 1.6596 1.1667 1.5844 1.3727 1.5239 1.2558 1.5008 1.5713 1.2178 7.9143 1.2089 2.1734 1.0496 1.2768 1.0529 1.2997 1.5783 1.1663 1.1163 1.0481 2.2054 2.1894 2.1648 6.0896 8.8866 6.0757 7.6827 7.2936 9.1036 1.0586 1.0589 1.0349 1.0295 1.1018 1.0873 1.0972 1.0585 1.1071 1.1012 1.1051 1.1014 1.0857 1.0877 1.0923 1.0963 1.1053 1.1015 1.0779 1.0781 1.0774
irintensity: 0.2538 0.0718 0.0902 0.2009 0.1380 0.3553 0.1897 0.1244 0.3450 0.4247 5.2799 8.0971 7.9537 8.4159 1.8399 13.4083 6.8977 7.0822 4.4827 1.6421 40.1847 1.3444 1.5860 44.3227 27.0205 1.3318 8.7854 16.3560 3.0309 0.1103 4.9397 2.3463 4.4791 1.4214 2.3806 18.1855 38.7244 4.3533 0.9007 3.4781 79.4309 13.0624 129.4803 60.5607 45.7661 68.3402 12.7190 3.8570 64.9113 9.2671 9.1084 0.2864 24.2885 4.7765 39.9185 12.3263 0.8186 29.7344 100.5439 15.3229 2.7600 130.0232 4.0681 74.9023 1.7475 3.6355 15.2659 2.5845 8.4844 13.6414 0.3736 296.5798 10.1658 24.3497 0.2040 168.2722 0.7779 0.1226 1.0242 27.2721 25.5462 2.0586 12.4636 11.4025 111.0643 5.7600 9.0020 3.5554 81.6233 20.0674 18.9020 0.6424 26.5346 10.7155 15.7030 157.9488 25.8693 742.3178 436.0040 115.2142 65.1290 16.0959 34.1534 174.7702 55.9042 2.9622 336.6155 0.2990 16.1047 141.6873 305.6432 50.1448 27.2718 14.0813 28.8073 15.0503 3.4898 19.4756 39.3134 7.2034 16.9080 20.5954 12.6399 4.0890 3.1848 23.7818 24.5902 11.7194 23.8658 177.2162 103.3419 154.4022
temp: 298.150 k
press: 1.00000 atm
elementType: 8 8 8 8 8 8 7 7 7 6 6 6 6 6 6 6 6 6 6 6 6 6 6 6 6 1 1 1 1 1 1 1 1 1 1 1 1 1 1 1 1 1 1 1 1 1
symmnumber: 1
zpe: 950843.8 jmol-1
zpe.correction: 0.362157 hartree
zpe.thermalcorrener: 0.388601 hartree
zpe.thermalcorrenthalpy: 0.389545 hartree
zpe.thermalcorrgfe: 0.298238 hartree
zpe.sumelectzpe: -1236.070031 hartree
zpe.sumelectthermal: -1236.043588 hartree
zpe.sumelectthermalent: -1236.042644 hartree
zpe.sumelectthermalfe: -1236.133950 hartree
dipole: 7.5975 1.4068 -0.0165
dipole: 7.7267
quadrupole: -85.9894 -140.9578 -156.0244
quadrupole: -0.0296 5.4636 5.9392
quadrupole: 41.6678 -13.3006 -28.3672 -0.0296 5.4636 5.9392
hfenergy: -1236.4321885 hartree
pointgroup: C01 [X(C16H21N3O6)]
dipole: 2.9077831 -0.8726217 0.156261 debye
polarizability: 280.0258021|-3.3151485|166.1346223|-15.4309941|7.7627552|192.8972185 unknown
InChI: InChI=1S/C16H21N3O6/c1-11(15(22)24-2)19-14(21)9-17-13(20)8-18-16(23)25-10-12-6-4-3-5-7-12/h3-7,11,17-19H,8-10H2,1-2H3
charge 0 multiplicity 1
46 atoms
O  8.21386 -2.086585 -0.344876
O  -4.257558 1.869644 0.598772
O  3.569372 -0.280292 -1.658143
O  7.069701 -1.46458 1.586876
O  0.124244 0.880232 1.634855
O  -3.549982 1.456292 -1.624088
N  4.994251 -0.470416 0.169552
N  1.438481 0.378973 -0.209784
N  -2.100023 1.27384 0.203002
C  6.161814 -0.870157 -0.632315
C  2.649815 0.163366 0.575226
C  6.791223 0.319402 -1.407028
C  3.776677 -0.214156 -0.402465
C  7.168092 -1.496185 0.335447
C  -0.932952 0.911455 -0.587656
C  0.251256 0.72377 0.377468
C  -6.474079 0.836299 0.092185
C  -5.647964 2.105672 0.088829
C  -7.292753 0.513726 1.203946
C  -6.440178 -0.045408 -1.019971
C  -3.310416 1.518864 -0.384693
C  -8.063477 -0.670543 1.21046
C  -7.209188 -1.229932 -1.014164
C  -8.023041 -1.545227 0.099756
C  9.274523 -2.705428 0.494826
H  5.847208 -1.632204 -1.370008
H  5.12678 -0.460474 1.187732
H  2.917506 1.075818 1.143909
H  2.494777 -0.638981 1.323458
H  6.031167 0.744455 -2.082234
H  7.647695 -0.03065 -2.006777
H  7.135085 1.104127 -0.710916
H  1.553592 0.250177 -1.224416
H  -1.110779 -0.022392 -1.157945
H  -0.696681 1.696439 -1.333693
H  -5.567552 2.533339 -0.925693
H  -6.046216 2.853148 0.793333
H  -1.967626 1.336282 1.218752
H  -7.322427 1.190505 2.066984
H  -5.79769 0.200914 -1.872899
H  -8.693598 -0.909606 2.074609
H  -7.177022 -1.90493 -1.876936
H  -8.621621 -2.463448 0.101615
H  10.005962 -3.094668 -0.225782
H  8.844492 -3.51538 1.106494
H  9.725452 -1.946295 1.154798
